Portál AbcLinuxu, 10. srpna 2022 04:36



Dotaz: K3b 0.10 vs kernel 2.4.22

13.10.2003 22:56 svaca | skóre: 38
K3b 0.10 vs kernel 2.4.22
Přečteno: 33×
Odpovědět | Admin
Pri kompilaci noveho k3b 0.10 pod Slackware 9.1 s kernel-headers 2.4.22 mi make vypise toto:

QT_NO_TRANSLATION -MT k3bdevice.lo -MD -MP -MF ".deps/k3bdevice.Tpo" \ -c -o k3bdevice.lo `test -f 'k3bdevice.cpp' || echo './'`k3bdevice.cpp; \ then mv -f ".deps/k3bdevice.Tpo" ".deps/k3bdevice.Plo"; \ else rm -f ".deps/k3bdevice.Tpo"; exit 1; \ fi In file included from /usr/include/linux/cdrom.h:14, from k3bscsicommand.h:20, from k3bdevice.cpp:23: /usr/include/asm/byteorder.h:38: syntax error before `(' token /usr/include/asm/byteorder.h:42: '__u64' is used as a type, but is not defined as a type. /usr/include/asm/byteorder.h:43: syntax error before `}' token /usr/include/asm/byteorder.h:44: syntax error before `.' token /usr/include/asm/byteorder.h:50: syntax error before `.' token /usr/include/asm/byteorder.h:51: syntax error before `.' token /usr/include/asm/byteorder.h:52: syntax error before `:' token In file included from /usr/include/linux/byteorder/little_endian.h:11, from /usr/include/asm/byteorder.h:65, from /usr/include/linux/cdrom.h:14, from k3bscsicommand.h:20, from k3bdevice.cpp:23: /usr/include/linux/byteorder/swab.h:199: syntax error before `(' token /usr/include/linux/byteorder/swab.h:209: syntax error before `(' token /usr/include/linux/byteorder/swab.h:213: `__u64' was not declared in this scope /usr/include/linux/byteorder/swab.h:213: `addr' was not declared in this scope /usr/include/linux/byteorder/swab.h:214: variable or field `__swab64s' declared void /usr/include/linux/byteorder/swab.h:214: `__swab64s' declared as an `inline' variable /usr/include/linux/byteorder/swab.h:214: syntax error before `{' token make[4]: *** [k3bdevice.lo] Error 1 make[4]: Leaving directory `/home/k3b-0.10/src/core/device' make[3]: *** [all-recursive] Error 1 make[3]: Leaving directory `/home/k3b-0.10/src/core' make[2]: *** [all-recursive] Error 1 make[2]: Leaving directory `/home/k3b-0.10/src' make[1]: *** [all-recursive] Error 1 make[1]: Leaving directory `/home/k3b-0.10' make: *** [all] Error 2

Mate nekdo stejny problem ???? Taky Vam to nechodi ????

Never give up ! Stay ATARI !
Nástroje: Začni sledovat (0) ?Zašle upozornění na váš email při vložení nového komentáře.

Odpovědi

15.10.2003 20:52 Karel Rychly
Rozbalit Rozbalit vše K3b 0.10 vs kernel 2.4.22
Odpovědět | | Sbalit | Link | Blokovat | Admin
Taky my to nechodi :((( V cem je problem? Mam uplne tu samou kombinaci: Slack-current 2.4.22, k3b-0.10. Karel
15.10.2003 23:15 M@to
Rozbalit Rozbalit vše K3b 0.10 vs kernel 2.4.22
Tiez som to vcera vecer nadcsene stiahol, configure prebehlo v poriadku, a pri kompilacii to po chvilke skoncilo na tej istej chybe. Slack current + kernel 2.4.22
15.10.2003 23:20 shamot
Rozbalit Rozbalit vše K3b 0.10 vs kernel 2.4.22
Odpovědět | | Sbalit | Link | Blokovat | Admin
to same s mandrake 9.1
16.10.2003 05:59 ...... | skóre: 41 | blog: ...
Rozbalit Rozbalit vše K3b 0.10 vs kernel 2.4.22
Odpovědět | | Sbalit | Link | Blokovat | Admin
asi su lama ......taky se mi to nepovedlo chjo

Založit nové vláknoNahoru

Tiskni Sdílej: Linkuj Jaggni to Vybrali.sme.sk Google Del.icio.us Facebook

ISSN 1214-1267, (c) 1999-2007 Stickfish s.r.o.