Portál AbcLinuxu, 17. května 2021 06:18


Dotaz: pri zadani make modules decnet error 2.4.28

12.2.2005 09:32 sykora | skóre: 18 | blog: LINUX
pri zadani make modules decnet error 2.4.28
Přečteno: 147×
Odpovědět | Admin
po zadaní make modules mi vypise toto:


make[2]: Leaving directory `/usr/src/linux-2.4.28/net/bluetooth'
make -C bridge modules
make[2]: Entering directory `/usr/src/linux-2.4.28/net/bridge'
make[2]: Nothing to be done for `modules'.
make[2]: Leaving directory `/usr/src/linux-2.4.28/net/bridge'
make -C core modules
make[2]: Entering directory `/usr/src/linux-2.4.28/net/core'
make[2]: Nothing to be done for `modules'.
make[2]: Leaving directory `/usr/src/linux-2.4.28/net/core'
make -C decnet modules
make[2]: Entering directory `/usr/src/linux-2.4.28/net/decnet'
gcc -D__KERNEL__ -I/usr/src/linux-2.4.28/include -Wall -Wstrict-prototypes -Wno-trigraphs -O2 -fno-strict-aliasing -fno-common -pipe -mpreferred-stack-boundary=2 -march=i586  -DMODULE -DMODVERSIONS -include /usr/src/linux-2.4.28/include/linux/modversions.h  -nostdinc -iwithprefix include -DKBUILD_BASENAME=dn_neigh  -c -o dn_neigh.o dn_neigh.c
dn_neigh.c:584: `THIS_MODULE' undeclared here (not in a function)
dn_neigh.c:584: initializer element is not constant
dn_neigh.c:584: (near initialization for `dn_neigh_seq_fops.owner')
make[2]: *** [dn_neigh.o] Error 1
make[2]: Leaving directory `/usr/src/linux-2.4.28/net/decnet'
make[1]: *** [_modsubdir_decnet] Error 2
make[1]: Leaving directory `/usr/src/linux-2.4.28/net'
make: *** [_mod_net] Error 2
[root@mdk linux-2.4.28]# make

ako opravím error?
Nástroje: Začni sledovat (0) ?Zašle upozornění na váš email při vložení nového komentáře.

Odpovědi

12.2.2005 10:12 0
Rozbalit Rozbalit vše Re: pri zadani make modules decnet error 2.4.28
Odpovědět | | Sbalit | Link | Blokovat | Admin
Nejlepsim resenim je pouzit novejsi jadro 2.4.29.

Pokud ten modul nepotrebjes, tak ho neprekladej. Pokud ano, asi budes muset skutecne pouzit to novejsi jadro nebo google.
12.2.2005 14:16 sykora | skóre: 18 | blog: LINUX
Rozbalit Rozbalit vše Re: pri zadani make modules decnet error 2.4.28
Odpovědět | | Sbalit | Link | Blokovat | Admin
Ano a nejde zapnut ani je podpora v jadre. Musel som ho vypnut a tak to je v poriadku. Zaobijdem sa i bez neho. Je to sietova vec.

OS

Založit nové vláknoNahoru

Tiskni Sdílej: Linkuj Jaggni to Vybrali.sme.sk Google Del.icio.us Facebook

ISSN 1214-1267, (c) 1999-2007 Stickfish s.r.o.