abclinuxu.cz AbcLinuxu.cz itbiz.cz ITBiz.cz HDmag.cz HDmag.cz abcprace.cz AbcPráce.cz
AbcLinuxu hledá autory!
Inzerujte na AbcPráce.cz od 950 Kč
Rozšířené hledání
×

včera 20:55 | Komunita

Linux ve VirtualBoxu nebude potřebovat Přídavky pro hosta (Guest Additions). Budou součástí linuxového jádra. Ovladač vboxguest by se měl dostat do Linuxu 4.16. Ovladač vboxsf by měl následovat.

Ladislav Hagara | Komentářů: 5
včera 17:11 | Komunita

Vývojáři Thunderbirdu žádají o vyplnění dotazníku. Upřednostňujete klasický vzhled nebo raději Monterail (GitHub)?

Ladislav Hagara | Komentářů: 14
včera 12:22 | Komunita

Mozilla.cz informuje, že většina problémů s rychlostí Firefoxu 57 při použití open source odečítače NVDA (NonVisual Desktop Access) budou vyřešeny hned v další verzi Firefoxu 58. NVDA je zatím dostupný pouze pro operační systémy Windows.

Ladislav Hagara | Komentářů: 0
včera 05:55 | Bezpečnostní upozornění

V knihovně glibc (GNU C Library) byla nalezena a v upstreamu opravena bezpečnostní chyba CVE-2018-1000001 (buffer underflow) zneužitelná k lokální eskalaci práv. Podrobnosti na halfdog.net.

Ladislav Hagara | Komentářů: 0
16.1. 13:11 | Komunita

Mozilla.cz informuje o 2 plánovaných novinkách ve Firefoxu. Nové webové funkce budou ve Firefoxu dostupné jen přes HTTPS (en) a nové verze Firefoxu přinesou rychlejší přepínání panelů (předehřívání nebo žhavení panelů, anglicky tab warming).

Ladislav Hagara | Komentářů: 5
16.1. 12:44 | IT novinky

Hodnota Bitcoinu, decentralizované kryptoměny, klesla na cca 12 000 dolarů. Před měsícem byla hodnota Bitcoinu téměř 20 000 dolarů [reddit].

Ladislav Hagara | Komentářů: 28
16.1. 05:55 | Bezpečnostní upozornění

Bezpečnostní tým Cisco Talos upozorňuje na celou řadu bezpečnostních chyb v Blenderu. Vývojáři Blenderu byli o chybách informování již v září. Dosud tyto chyby ale opraveny nebyly. Doporučeno je neotevírat v Blenderu soubory z nedůvěryhodných zdrojů.

Ladislav Hagara | Komentářů: 2
15.1. 17:22 | Bezpečnostní upozornění

Společnost F-Secure upozorňuje na bezpečnostní "problém" v Intel AMT (Active Management Technology). Útočník s fyzickým přístupem k počítači s povoleným AMT a nenastaveným heslem k MEBx (Management Engine BIOS Extension) může obejít heslo nastavené v BIOSu, pin v TPM, přihlašovací jméno a heslo do operačního systému nebo i šifrování disků restartováním tohoto počítače a při jeho startu zavedením MEBx (CTRL-P) a zadáním výchozího hesla "admin". Pak už útočníkovi stačí pouze změnit heslo a povolit vzdálený přístup k počítači na úrovni AMT.

Ladislav Hagara | Komentářů: 10
15.1. 15:11 | Zajímavý projekt

Na Indiegogo byla dnes spuštěna kampaň na podporu 6 palcového notebooku a kapesní herní konzole GPD WIN 2. Cena v rámci kampaně byla stanovena na 649 dolarů. Cílová částka 100 tisíc dolarů byla překonána již 8 krát. Ukázka s Linuxem na YouTube.

Ladislav Hagara | Komentářů: 5
15.1. 05:55 | Bezpečnostní upozornění

V GitLabu, v open source alternativě GitHubu, tj. v softwarovém nástroji s webovým rozhraním umožňujícím spolupráci na zdrojových kódech, byl nalezen vážný bezpečnostní problém. Bezpečnostní aktualizace bude vydána ve středu 17. ledna v 00:59.

Ladislav Hagara | Komentářů: 3
Jak se vás potenciálně dotkne trend odstraňování analogového audio konektoru typu 3,5mm jack z „chytrých telefonů“?
 (7%)
 (1%)
 (1%)
 (1%)
 (77%)
 (13%)
Celkem 1317 hlasů
 Komentářů: 53, poslední včera 16:55
    Rozcestník

    Dotaz: chyba při kompilování a instalování (sogo source)

    1.3.2012 11:25 mhh
    chyba při kompilování a instalování (sogo source)
    Přečteno: 194×
    Mám takový problém, bohužel když jsem ho googlil, tak pánům z inverse nefungovali(a stále nefungují) stránky s podporou. Něco to našlo, ale bohužel se nejde prokliknout. Ve fázi, kdy kompiluju a instaluju SOGO mi vypíše error. SOPE prošlo bez problémů. Nevíte prosím vás, co stím?dky

    ......... all in Appointments...
    Making all for wobundle Appointments...
     Compiling file MSExchangeFreeBusy.m ...
    MSExchangeFreeBusy.m:37:22: warning: curl/curl.h: Adresář nebo soubor neexistuje
    MSExchangeFreeBusy.m: In function ‘-[MSExchangeFreeBusy fetchFreeBusyInfosFrom:to:forEmail:inSource:inContext:]’:
    MSExchangeFreeBusy.m:103: error: ‘CURL’ undeclared (first use in this function)
    MSExchangeFreeBusy.m:103: error: (Each undeclared identifier is reported only once
    MSExchangeFreeBusy.m:103: error: for each function it appears in.)
    MSExchangeFreeBusy.m:103: error: ‘curl’ undeclared (first use in this function)
    MSExchangeFreeBusy.m:105: error: ‘CURLcode’ undeclared (first use in this function)
    MSExchangeFreeBusy.m:105: error: expected ‘;’ before ‘rc’
    MSExchangeFreeBusy.m:106: error: ‘CURL_ERROR_SIZE’ undeclared (first use in this function)
    MSExchangeFreeBusy.m:119: warning: implicit declaration of function ‘curl_global_init’
    MSExchangeFreeBusy.m:119: error: ‘CURL_GLOBAL_SSL’ undeclared (first use in this function)
    MSExchangeFreeBusy.m:120: warning: implicit declaration of function ‘curl_easy_init’
    MSExchangeFreeBusy.m:121: warning: implicit declaration of function ‘curl_slist_append’
    MSExchangeFreeBusy.m:121: warning: assignment makes pointer from integer without a cast
    MSExchangeFreeBusy.m:131: warning: implicit declaration of function ‘curl_easy_setopt’
    MSExchangeFreeBusy.m:131: error: ‘CURLOPT_USERPWD’ undeclared (first use in this function)
    MSExchangeFreeBusy.m:132: error: ‘CURLOPT_HTTPAUTH’ undeclared (first use in this function)
    MSExchangeFreeBusy.m:132: error: ‘CURLAUTH_NTLM’ undeclared (first use in this function)
    MSExchangeFreeBusy.m:135: error: ‘CURLOPT_URL’ undeclared (first use in this function)
    MSExchangeFreeBusy.m:136: error: ‘CURLOPT_HTTPHEADER’ undeclared (first use in this function)
    MSExchangeFreeBusy.m:137: error: ‘CURLOPT_POSTFIELDS’ undeclared (first use in this function)
    MSExchangeFreeBusy.m:140: error: ‘CURLOPT_SSL_VERIFYPEER’ undeclared (first use in this function)
    MSExchangeFreeBusy.m:141: error: ‘CURLOPT_SSL_VERIFYHOST’ undeclared (first use in this function)
    MSExchangeFreeBusy.m:142: error: ‘CURLOPT_WRITEFUNCTION’ undeclared (first use in this function)
    MSExchangeFreeBusy.m:143: error: ‘CURLOPT_WRITEDATA’ undeclared (first use in this function)
    MSExchangeFreeBusy.m:144: error: ‘CURLOPT_ERRORBUFFER’ undeclared (first use in this function)
    MSExchangeFreeBusy.m:147: error: ‘rc’ undeclared (first use in this function)
    MSExchangeFreeBusy.m:147: warning: implicit declaration of function ‘curl_easy_perform’
    MSExchangeFreeBusy.m:150: warning: implicit declaration of function ‘curl_easy_cleanup’
    MSExchangeFreeBusy.m:151: warning: implicit declaration of function ‘curl_slist_free_all’
    MSExchangeFreeBusy.m:106: warning: unused variable ‘error’
    make[3]: *** [obj/MSExchangeFreeBusy.m.o] Error 1
    make[2]: *** [Appointments.all.wobundle.variables] Error 2
    make[1]: *** [internal-all] Error 2
    make: *** [internal-all] Error 2
    

    Odpovědi

    1.3.2012 11:41 chrono
    Rozbalit Rozbalit vše Re: chyba při kompilování a instalování (sogo source)
    Devel balík knižnice curl je nainštalovaný?
    1.3.2012 11:57 mhh
    Rozbalit Rozbalit vše Re: chyba při kompilování a instalování (sogo source)
    díky mnohokrát
    1.3.2012 12:08 mhh
    Rozbalit Rozbalit vše Re: chyba při kompilování a instalování (sogo source)
    Ještě se vyskytla chyba při kompilování Openchange/sogo konektoru... Říká Vám to něco?

    lampserver@phpserver:~/SOGo/OpenChange$ make
    This is gnustep-make 2.2.0. Type 'make print-gnustep-make-help' for help.
    Making all in subprojects of bundle SOGoBackend...
    Making all for subproject unrtf...
    make[3]: Nothing to be done for `internal-subproject-compile'.
    Making all for bundle SOGoBackend...
     Compiling file MAPIStoreFallbackContext.m ...
    MAPIStoreFallbackContext.m: In function ‘+[MAPIStoreFallbackContext createRootSecondaryFolderWithFID:andName:forUser:]’:
    MAPIStoreFallbackContext.m:97: error: expected ‘:’ before string constant
    make[2]: *** [obj/MAPIStoreFallbackContext.m.o] Error 1
    make[1]: *** [internal-bundle-run-compile-submake] Error 2
    make: *** [SOGoBackend.all.bundle.variables] Error 2
    1.3.2012 13:04 mhh
    Rozbalit Rozbalit vše Re: chyba při kompilování a instalování (sogo source)
    syntaktická chyba?

    MAPIStoreFallbackContext.m http://pastebin.com/SnWBEsgJ
    1.3.2012 13:07 mhh
    Rozbalit Rozbalit vše Re: chyba při kompilování a instalování (sogo source)
    Tohle je ten správný soubor. Na 97 řádku nevidím žádnou chybu http://pastebin.com/cwRBfHb4
    1.3.2012 13:16 chochi | skóre: 29 | Praha
    Rozbalit Rozbalit vše Re: chyba při kompilování a instalování (sogo source)
    Chybi deklarace PRIx64, takze bych doporucil nekam na zacatek dat:
    
    #include <inttypes.h>
    
    1.3.2012 14:57 mhh
    Rozbalit Rozbalit vše Re: chyba při kompilování a instalování (sogo source)
    Díky, pokročil jsem, ale další chyba. To je neskutečný

    Making all for library MAPIStoreSOGo...
     Compiling file MAPIStoreSOGo.m ...
    cc1obj: warnings being treated as errors
    MAPIStoreSOGo.m: In function ‘mapistore_init_backend’:
    MAPIStoreSOGo.m:1279: error: assignment from incompatible pointer type
    make[2]: *** [obj/MAPIStoreSOGo.m.o] Error 1
    make[1]: *** [internal-library-all_] Error 2
    make: *** [MAPIStoreSOGo.all.library.variables] Error 2
    1.3.2012 15:33 chochi | skóre: 29 | Praha
    Rozbalit Rozbalit vše Re: chyba při kompilování a instalování (sogo source)
    Hm... to vypada ze si nejak nerozumi verze SOGo a OpenChange.
    Jake mate verze SOGo a OpenChange?
    1.3.2012 15:45 chochi | skóre: 29 | Praha
    Rozbalit Rozbalit vše Re: chyba při kompilování a instalování (sogo source)
    Tak muj odhad - obe pouzivate z verzovaciho systemu (popripade sourcede snapshot) - jinak by to byla moc nuda :-) .
    Pokud pouzivate OpenChange z vetve "sogo" v revizi 3606 - 3613, tak by to zbusobovalo asi takovou chybu. Doporuceni je update alespon na revize 3614.
    2.3.2012 07:14 mhh
    Rozbalit Rozbalit vše Re: chyba při kompilování a instalování (sogo source)
    openchange používám revizi 3751
    https://svn.openchange.org/openchange/branches/sogo/
    2.3.2012 07:21 mhh
    Rozbalit Rozbalit vše Re: chyba při kompilování a instalování (sogo source)
    ne, pravda, spustil jsem to s parametrem -r 3612 :) zkusím updatnout a dám vědět.díky
    1.3.2012 14:59 mhh
    Rozbalit Rozbalit vše Re: chyba při kompilování a instalování (sogo source)
    MAPIStoreSOGo.m http://pastebin.com/mk2YNYsC

    Založit nové vláknoNahoru

    Tiskni Sdílej: Linkuj Jaggni to Vybrali.sme.sk Google Del.icio.us Facebook

    ISSN 1214-1267   www.czech-server.cz
    © 1999-2015 Nitemedia s. r. o. Všechna práva vyhrazena.