abclinuxu.cz AbcLinuxu.cz itbiz.cz ITBiz.cz HDmag.cz HDmag.cz abcprace.cz AbcPráce.cz
AbcLinuxu hledá autory!
Inzerujte na AbcPráce.cz od 950 Kč
Rozšířené hledání
×

včera 18:55 | Nová verze

Byla vydána nová stabilní verze 1.9 (1.9.818.44) webového prohlížeče Vivaldi (Wikipedie). Z novinek vývojáři zdůrazňují podporu nového vyhledávače Ecosia. Ten z příjmů z reklam podporuje výsadbu stromů po celém světě (YouTube). Nově lze přeskupovat ikonky rozšíření nebo řadit poznámky. Nejnovější Vivaldi je postaveno na Chromiu 58.0.3029.82.

Ladislav Hagara | Komentářů: 2
včera 17:00 | Nová verze

Byla vydána verze 3.7.0 svobodného systému pro správu obsahu (CMS) Joomla!. V oznámení o vydání (YouTube) se píše o 700 vylepšeních. Opraveno bylo také 8 bezpečnostních chyb.

Ladislav Hagara | Komentářů: 0
včera 08:22 | Komunita

Grsecurity (Wikipedie) je sada bezpečnostních patchů pro linuxové jádro (porovnání se SELinuxem, AppArmorem a KSPP). Od září 2015 nejsou stabilní verze těchto patchů volně k dispozici. Dle včerejšího oznámení (FAQ) nejsou s okamžitou platností volně k dispozici už ani jejich testovací verze.

Ladislav Hagara | Komentářů: 31
26.4. 23:33 | Komunita

OpenBSD 6.1 vyšlo již 11. dubna. Po dvou týdnech byla vydána i oficiální píseň. Její název je Winter of 95 a k dispozici je ve formátech MP3 a OGG.

Ladislav Hagara | Komentářů: 0
26.4. 18:55 | Nová verze

Byla vydána verze 2017.1 linuxové distribuce navržené pro digitální forenzní analýzu a penetrační testování Kali Linux. S vydáním verze 2016.1 se Kali Linux stal průběžně aktualizovanou distribucí. Aktualizovat jej lze pomocí příkazů "apt update; apt dist-upgrade; reboot".

Ladislav Hagara | Komentářů: 0
26.4. 18:22 | Nová verze

Po téměř pěti letech od vydání verze 2.00 byla vydána nová stabilní verze 2.02 systémového zavaděče GNU GRUB (GRand Unified Bootloader). Přehled novinek v souboru NEWS.

Ladislav Hagara | Komentářů: 12
26.4. 17:55 | Komunita

Vývojáři Debianu oznámili, že od 1. listopadu letošního roku nebudou jejich archivy dostupné pomocí protokolu FTP. Již v lednu oznámil ukončení podpory FTP kernel.org (The Linux Kernel Archives).

Ladislav Hagara | Komentářů: 22
26.4. 17:00 | Bezpečnostní upozornění

V oblíbeném webmailu postaveném na PHP SquirrelMail (Wikipedie) byla nalezena bezpečnostní chyba CVE-2017-7692, jež může být útočníkem zneužita ke spuštění libovolných příkazů a kompletnímu ovládnutí dotčeného serveru. Zranitelnost se týká pouze instancí, kde je pro transport používán Sendmail.

Ladislav Hagara | Komentářů: 3
26.4. 13:11 | Zajímavý článek

Soudní dvůr Evropské unie rozhodl (tisková zpráva) ve věci C-527/15: Prodej multimediálního přehrávače, který umožňuje zdarma a jednoduše zhlédnout na televizní obrazovce filmy protiprávně zpřístupněné na internetu, může představovat porušení autorského práva.

Ladislav Hagara | Komentářů: 31
25.4. 13:33 | Pozvánky

Byly stanoveny termíny konferencí LinuxDays 2017 a OpenAlt 2017. Letošní LinuxDays proběhne o víkendu 7. a 8. října v Praze v Dejvicích v prostorách FIT ČVUT. Letošní OpenAlt proběhne o víkendu 4. a 5. listopadu na FIT VUT v Brně.

Ladislav Hagara | Komentářů: 0
Chystáte se pořídit CPU AMD Ryzen?
 (4%)
 (35%)
 (1%)
 (6%)
 (45%)
 (9%)
Celkem 327 hlasů
 Komentářů: 50, poslední včera 04:06
    Rozcestník

    Dotaz: acpi4asus

    29.10.2006 15:52 czechraf
    acpi4asus
    Přečteno: 227×
    Ahoj, chtěl jsem nainstalovat acpi4asus verze 0.30, ale po napsání make mi to vyplivne par chyb. V linuxu moc neumim, mohli byste mi pls poradit jak na to? Používám Mandrivu 2007 a ASUS M6VA. Přikládám výpis. Díky.
    [root@localhost acpi4asus-0.30]# make
    make -C driver
    make[1]: Entering directory `/home/install/acpi4asus-0.30/driver'
    gcc -DLINUX -D__KERNEL__ -DMODULE -I/lib/modules/2.6.17-5mdv/build/include `./get_include.sh /lib/modules/2.6.17-5mdv/build/drivers/acpi /lib/modules/2.6.17-5mdv/build/include/acpi` -Wall -Wstrict-prototypes -fno-strict-aliasing -pipe -mpreferred-stack-boundary=2   -c -o asus_core.o asus_core.c
    In file included from /lib/modules/2.6.17-5mdv/build/include/linux/rwsem.h:27,
                     from /lib/modules/2.6.17-5mdv/build/include/asm/semaphore.h:42,
                     from /lib/modules/2.6.17-5mdv/build/include/linux/sched.h:20,
                     from /lib/modules/2.6.17-5mdv/build/include/linux/module.h:10,
                     from asus_core.c:34:
    /lib/modules/2.6.17-5mdv/build/include/asm/rwsem.h: In function ‘__down_read’:
    /lib/modules/2.6.17-5mdv/build/include/asm/rwsem.h:105: error: expected ‘:’ or ‘)’ before ‘KBUILD_BASENAME’
    /lib/modules/2.6.17-5mdv/build/include/asm/rwsem.h: In function ‘__down_write’:
    /lib/modules/2.6.17-5mdv/build/include/asm/rwsem.h:157: error: expected ‘:’ or ‘)’ before ‘KBUILD_BASENAME’
    /lib/modules/2.6.17-5mdv/build/include/asm/rwsem.h: In function ‘__up_read’:
    /lib/modules/2.6.17-5mdv/build/include/asm/rwsem.h:194: error: expected ‘:’ or ‘)’ before ‘KBUILD_BASENAME’
    /lib/modules/2.6.17-5mdv/build/include/asm/rwsem.h:188: warning: unused variable ‘tmp’
    /lib/modules/2.6.17-5mdv/build/include/asm/rwsem.h: In function ‘__up_write’:
    /lib/modules/2.6.17-5mdv/build/include/asm/rwsem.h:220: error: expected ‘:’ or ‘)’ before ‘KBUILD_BASENAME’
    /lib/modules/2.6.17-5mdv/build/include/asm/rwsem.h: In function ‘__downgrade_write’:
    /lib/modules/2.6.17-5mdv/build/include/asm/rwsem.h:245: error: expected ‘:’ or ‘)’ before ‘KBUILD_BASENAME’
    In file included from /lib/modules/2.6.17-5mdv/build/include/linux/sched.h:20,
                     from /lib/modules/2.6.17-5mdv/build/include/linux/module.h:10,
                     from asus_core.c:34:
    /lib/modules/2.6.17-5mdv/build/include/asm/semaphore.h: In function ‘down’:
    /lib/modules/2.6.17-5mdv/build/include/asm/semaphore.h:105: error: expected ‘:’ or ‘)’ before ‘KBUILD_BASENAME’
    /lib/modules/2.6.17-5mdv/build/include/asm/semaphore.h: In function ‘down_interruptible’:
    /lib/modules/2.6.17-5mdv/build/include/asm/semaphore.h:130: error: expected ‘:’ or ‘)’ before ‘KBUILD_BASENAME’
    /lib/modules/2.6.17-5mdv/build/include/asm/semaphore.h: In function ‘down_trylock’:
    /lib/modules/2.6.17-5mdv/build/include/asm/semaphore.h:155: error: expected ‘:’ or ‘)’ before ‘KBUILD_BASENAME’
    /lib/modules/2.6.17-5mdv/build/include/asm/semaphore.h: In function ‘up’:
    /lib/modules/2.6.17-5mdv/build/include/asm/semaphore.h:179: error: expected ‘:’ or ‘)’ before ‘KBUILD_BASENAME’
    In file included from /lib/modules/2.6.17-5mdv/build/include/asm/smp.h:18,
                     from /lib/modules/2.6.17-5mdv/build/include/linux/smp.h:19,
                     from /lib/modules/2.6.17-5mdv/build/include/linux/sched.h:26,
                     from /lib/modules/2.6.17-5mdv/build/include/linux/module.h:10,
                     from asus_core.c:34:
    /lib/modules/2.6.17-5mdv/build/include/asm/mpspec.h:6:25: error: mach_mpspec.h: není souborem ani adresářem
    In file included from /lib/modules/2.6.17-5mdv/build/include/asm/smp.h:18,
                     from /lib/modules/2.6.17-5mdv/build/include/linux/smp.h:19,
                     from /lib/modules/2.6.17-5mdv/build/include/linux/sched.h:26,
                     from /lib/modules/2.6.17-5mdv/build/include/linux/module.h:10,
                     from asus_core.c:34:
    /lib/modules/2.6.17-5mdv/build/include/asm/mpspec.h: At top level:
    /lib/modules/2.6.17-5mdv/build/include/asm/mpspec.h:8: error: ‘MAX_MP_BUSSES’ undeclared here (not in a function)
    /lib/modules/2.6.17-5mdv/build/include/asm/mpspec.h:22: error: ‘MAX_IRQ_SOURCES’ undeclared here (not in a function)
    In file included from /lib/modules/2.6.17-5mdv/build/include/linux/smp.h:19,
                     from /lib/modules/2.6.17-5mdv/build/include/linux/sched.h:26,
                     from /lib/modules/2.6.17-5mdv/build/include/linux/module.h:10,
                     from asus_core.c:34:
    /lib/modules/2.6.17-5mdv/build/include/asm/smp.h:77:26: error: mach_apicdef.h: není souborem ani adresářem
    In file included from /lib/modules/2.6.17-5mdv/build/include/linux/smp.h:19,
                     from /lib/modules/2.6.17-5mdv/build/include/linux/sched.h:26,
                     from /lib/modules/2.6.17-5mdv/build/include/linux/module.h:10,
                     from asus_core.c:34:
    /lib/modules/2.6.17-5mdv/build/include/asm/smp.h: In function ‘hard_smp_processor_id’:
    /lib/modules/2.6.17-5mdv/build/include/asm/smp.h:81: warning: implicit declaration of function ‘GET_APIC_ID’
    asus_core.c: In function ‘asus_hotk_get_info’:
    asus_core.c:1172: warning: pointer targets in assignment differ in signedness
    make[1]: *** [asus_core.o] Error 1
    make[1]: Leaving directory `/home/install/acpi4asus-0.30/driver'
    make: *** [build] Error 2
    

    Odpovědi

    29.10.2006 16:51 Martinus | skóre: 21 | blog: martinus
    Rozbalit Rozbalit vše Re: acpi4asus
    Ahoj, asi to neni odpověď přesně na vaši otázku, ale v Mandrivě by tuším asus-acpi mělo existovat jako balíček (pokud je to to samé co acpi4asus), mě se alespoň nainstalovalo při instalaci systému (mám asus m6a)...
    Free your mind and the ass will follow...
    29.10.2006 16:53 Martinus | skóre: 21 | blog: martinus
    Rozbalit Rozbalit vše Re: acpi4asus
    Ano, ted jsem koukal - je to standardní součástí jádra od 2.4
    Free your mind and the ass will follow...

    Založit nové vláknoNahoru

    Tiskni Sdílej: Linkuj Jaggni to Vybrali.sme.sk Google Del.icio.us Facebook

    ISSN 1214-1267   www.czech-server.cz
    © 1999-2015 Nitemedia s. r. o. Všechna práva vyhrazena.