abclinuxu.cz AbcLinuxu.cz itbiz.cz ITBiz.cz HDmag.cz HDmag.cz abcprace.cz AbcPráce.cz
AbcLinuxu hledá autory!
Inzerujte na AbcPráce.cz od 950 Kč
Rozšířené hledání
×
eParkomat, startup z ČR, postoupil mezi finalisty evropského akcelerátoru ChallengeUp!
Robot na pivo mu otevřel dveře k opravdovému byznysu
Internet věcí: Propojený svět? Už se to blíží...
včera 22:44 | Komunita

Joinup informuje, že Mnichov používá open source groupware Kolab. V srpnu byl dokončen dvouletý přechod na toto řešení. V provozu je asi 60 000 poštovních schránek. Nejenom Kolabu se věnoval Georg Greve ve své přednášce Open Source: the future for the European institutions (SlideShare) na konferenci DIGITEC 2016, jež proběhla v úterý 29. listopadu v Bruselu. Videozáznam přednášek z hlavního sálu je ke zhlédnutí na Livestreamu.

Ladislav Hagara | Komentářů: 1
včera 15:30 | Zajímavý projekt

Společnost Jolla oznámila v příspěvku Case study: Sailfish Watch na svém blogu, že naportovala Sailfish OS na chytré hodinky. Využila a inspirovala se otevřeným operačním systémem pro chytré hodinky AsteroidOS. Použita je knihovna libhybris. Ukázka ovládání hodinek na YouTube.

Ladislav Hagara | Komentářů: 5
včera 14:15 | Nová verze

Byla vydána verze 7.1.0 skriptovacího jazyka PHP používaného zejména k vývoji dynamických webových stránek. Jedná se o první stabilní verzi nejnovější větvě 7.1. Přehled novinek v dokumentaci. Podrobnosti v ChangeLogu. K dispozici je také příručka pro přechod z PHP 7.0.x na PHP 7.1.x.

Ladislav Hagara | Komentářů: 0
včera 12:55 | Nová verze

Google Chrome 55 byl prohlášen za stabilní. Nejnovější stabilní verze 55.0.2883.75 tohoto webového prohlížeče přináší řadu oprav a vylepšení (YouTube). Opraveno bylo také 36 bezpečnostních chyb. Mariusz Mlynski si například vydělal 22 500 dolarů za 3 nahlášené chyby (Universal XSS in Blink).

Ladislav Hagara | Komentářů: 4
včera 11:55 | Pozvánky

Máte rádi svobodný software a hardware nebo se o nich chcete něco dozvědět? Přijďte na 135. sraz spolku OpenAlt, který se bude konat ve čtvrtek 8. prosince od 18:00 v Radegastovně Perón (Stroupežnického 20, Praha 5). Sraz bude tentokrát tématický. Bude retro! K vidění budou přístroje jako Psion 5mx nebo Palm Z22. Ze svobodného hardwaru pak Openmoko nebo čtečka WikiReader. Přijďte se i vy pochlubit svými legendami, nebo alespoň na pivo. Moderní hardware má vstup samozřejmě také povolen.

xkucf03 | Komentářů: 0
včera 00:10 | Nová verze

Byla vydána verze 3.2 svobodného systému pro detekci a prevenci průniků a monitorování bezpečnosti počítačových sítí Suricata. Z novinek lze zmínit například podporu protokolů DNP3 a CIP/ENIP, vylepšenou podporu TLS a samozřejmě také aktualizovanou dokumentaci.

Ladislav Hagara | Komentářů: 0
1.12. 21:00 | Nová verze

Byla vydána beta verze Linux Mintu 18.1 s kódovým jménem Serena. Na blogu Linux Mintu jsou hned dvě oznámení. První o vydání Linux Mintu s prostředím MATE a druhé o vydání Linux Mintu s prostředím Cinnamon. Stejným způsobem jsou rozděleny také poznámky k vydání (MATE, Cinnamon) a přehled novinek s náhledy (MATE, Cinnamon). Linux Mint 18.1 bude podporován až do roku 2021.

Ladislav Hagara | Komentářů: 0
1.12. 16:42 | Nová verze

Byl vydán Devuan Jessie 1.0 Beta 2. Jedná se o druhou beta verzi forku Debianu bez systemd představeného v listopadu 2014 (zprávička). První beta verze byla vydána v dubnu letošního roku (zprávička). Jedna z posledních přednášek věnovaných Devuanu proběhla v listopadu na konferenci FSCONS 2016 (YouTube, pdf).

Ladislav Hagara | Komentářů: 0
1.12. 15:16 | Komunita

Na GOG.com začal zimní výprodej. Řada zlevněných her běží oficiálně také na Linuxu. Hru Neverwinter Nights Diamond lze dva dny získat zdarma. Hra dle stránek GOG.com na Linuxu neběží. Pomocí návodu ji lze ale rozběhnout také na Linuxu [Gaming On Linux].

Ladislav Hagara | Komentářů: 1
1.12. 13:14 | Bezpečnostní upozornění

Byla vydána verze 2.7.1 živé linuxové distribuce Tails (The Amnesic Incognito Live System), jež klade důraz na ochranu soukromí uživatelů a anonymitu. Řešeno je několik bezpečnostních problémů. Aktualizován byl především Tor Browser na verzi 6.0.7. Tor Browser je postaven na Firefoxu ESR (Extended Support Release) a právě ve Firefoxu byla nalezena a opravena vážná bezpečnostní chyba MFSA 2016-92 (CVE-2016-9079, Firefox SVG Animation

… více »
Ladislav Hagara | Komentářů: 0
Kolik máte dat ve svém domovském adresáři na svém primárním osobním počítači?
 (32%)
 (24%)
 (29%)
 (7%)
 (5%)
 (3%)
Celkem 759 hlasů
 Komentářů: 50, poslední 29.11. 15:50
Rozcestník
Reklama

Dotaz: Jak se dostat dál s kompilací TrueCryptu?

21.12.2008 16:48 zdenek2008 | skóre: 20
Jak se dostat dál s kompilací TrueCryptu?
Přečteno: 722×
Na Fedoře 8 bych si chtěl nainstalovat TrueCrypt, který si musím ale nejdříve sám zkompilovat. Bohužel dostávám takováhle hlášení:

[xx@pc truecrypt-6.1a-source]$ make
Compiling Keyfile.cpp
Compiling Pkcs5Kdf.cpp
Compiling Volume.cpp
Compiling VolumeException.cpp
Compiling VolumeHeader.cpp
Compiling VolumeInfo.cpp
Compiling VolumeLayout.cpp
Compiling VolumePassword.cpp
Compiling VolumePasswordCache.cpp
Compiling Aescrypt.c
Compiling Aeskey.c
Compiling Aestab.c
Compiling Blowfish.c
Compiling Cast.c
Compiling Des.c
Compiling Rmd160.c
Compiling Serpent.c
Compiling Sha1.c
Compiling Sha2.c
Compiling Twofish.c
Compiling Whirlpool.c
Compiling Crc.c
Compiling Endian.c
Compiling GfMul.c
Compiling Pkcs5.c
Compiling SecurityToken.cpp
Updating library Volume.a
Package fuse was not found in the pkg-config search path.
Perhaps you should add the directory containing `fuse.pc'
to the PKG_CONFIG_PATH environment variable
No package 'fuse' found
Package fuse was not found in the pkg-config search path.
Perhaps you should add the directory containing `fuse.pc'
to the PKG_CONFIG_PATH environment variable
No package 'fuse' found
Compiling FuseService.cpp
FuseService.cpp:12:18: warning: fuse.h: No such file or directory
FuseService.cpp: In function ‘int TrueCrypt::fuse_service_open(const char*, TrueCrypt::fuse_file_info*)’:
FuseService.cpp:172: error: invalid use of undefined type ‘struct TrueCrypt::fuse_file_info’
FuseService.cpp:142: error: forward declaration of ‘struct TrueCrypt::fuse_file_info’
FuseService.cpp: At global scope:
FuseService.cpp:251: error: ‘fuse_fill_dir_t’ has not been declared
FuseService.cpp: In function ‘int TrueCrypt::fuse_service_readdir(const char*, void*, int, off_t, TrueCrypt::fuse_file_info*)’:
FuseService.cpp:261: error: ‘filler’ cannot be used as a function
FuseService.cpp:262: error: ‘filler’ cannot be used as a function
FuseService.cpp:263: error: ‘filler’ cannot be used as a function
FuseService.cpp:264: error: ‘filler’ cannot be used as a function
FuseService.cpp: In static member function ‘static bool TrueCrypt::FuseService::CheckAccessRights()’:
FuseService.cpp:317: error: ‘fuse_get_context’ was not declared in this scope
FuseService.cpp: In member function ‘virtual void TrueCrypt::FuseService::ExecFunctor::operator()(int, char**)’:
FuseService.cpp:540: error: ‘fuse_operations’ does not name a type
FuseService.cpp:542: error: ‘fuse_service_oper’ was not declared in this scope
FuseService.cpp:582: error: ‘fuse_main’ was not declared in this scope
make[1]: *** [FuseService.o] Error 1
make: *** [all] Error 2
[xx@pc truecrypt-6.1a-source]$
Podle Kpackage je FUSE naistalovaný, tak nevím...

Odpovědi

21.12.2008 17:02 Peter Golis | skóre: 53 | Bratislava
Rozbalit Rozbalit vše Re: Jak se dostat dál s kompilací TrueCryptu?

Package fuse was not found in the pkg-config search path.
Perhaps you should add the directory containing `fuse.pc'
to the PKG_CONFIG_PATH environment variable
No package 'fuse' found


fuse-devel?

21.12.2008 17:33 zdenek2008 | skóre: 20
Rozbalit Rozbalit vše Re: Jak se dostat dál s kompilací TrueCryptu?
Doinstaloval jsem fuse-devel a libconfuse. Teď to vypadá jinak:

[zm@localhost truecrypt-6.1a-source]$ make
Compiling FuseService.cpp
Updating library Driver.a
Compiling CoreBase.cpp
Compiling CoreException.cpp
Compiling FatFormatter.cpp
Compiling HostDevice.cpp
Compiling MountOptions.cpp
Compiling RandomNumberGenerator.cpp
Compiling VolumeCreator.cpp
Compiling CoreService.cpp
Compiling CoreServiceRequest.cpp
Compiling CoreServiceResponse.cpp
Compiling CoreUnix.cpp
Compiling CoreLinux.cpp
Updating library Core.a
make[1]: wx-config: Command not found
make[1]: wx-config: Command not found
Precompiling SystemPrecompiled.h
SystemPrecompiled.h:9:19: warning: wx/wx.h: No such file or directory
SystemPrecompiled.h:10:25: warning: wx/filename.h: No such file or directory
SystemPrecompiled.h:11:24: warning: wx/mstream.h: No such file or directory
SystemPrecompiled.h:12:25: warning: wx/snglinst.h: No such file or directory
SystemPrecompiled.h:13:24: warning: wx/txtstrm.h: No such file or directory
SystemPrecompiled.h:14:25: warning: wx/wfstream.h: No such file or directory
SystemPrecompiled.h:17:20: warning: wx/dnd.h: No such file or directory
SystemPrecompiled.h:18:26: warning: wx/hyperlink.h: No such file or directory
SystemPrecompiled.h:19:25: warning: wx/listctrl.h: No such file or directory
SystemPrecompiled.h:20:25: warning: wx/imaglist.h: No such file or directory
SystemPrecompiled.h:21:22: warning: wx/power.h: No such file or directory
SystemPrecompiled.h:22:24: warning: wx/taskbar.h: No such file or directory
SystemPrecompiled.h:23:23: warning: wx/valgen.h: No such file or directory
make[1]: wx-config: Command not found
make[1]: wx-config: Command not found
Compiling Application.cpp
Application.cpp:10:25: warning: wx/stdpaths.h: No such file or directory
/home/zm/instalace/truecrypt-6.1a-source/Main/StringFormatter.h:28: error: expected ‘,’ or ‘...’ before ‘&’ token
/home/zm/instalace/truecrypt-6.1a-source/Main/StringFormatter.h:28: error: ISO C++ forbids declaration of ‘wxString’ with no type
/home/zm/instalace/truecrypt-6.1a-source/Main/StringFormatter.h:29: error: ‘TrueCrypt::StringFormatterArg::StringFormatterArg(TrueCrypt::int32)’ cannot be overloaded
/home/zm/instalace/truecrypt-6.1a-source/Main/StringFormatter.h:28: error: with ‘TrueCrypt::StringFormatterArg::StringFormatterArg(int)’
/home/zm/instalace/truecrypt-6.1a-source/Main/StringFormatter.h:34: error: expected type-specifier before ‘wxString’
/home/zm/instalace/truecrypt-6.1a-source/Main/StringFormatter.h:42: error: ‘wxString’ does not name a type
/home/zm/instalace/truecrypt-6.1a-source/Main/StringFormatter.h: In constructor ‘TrueCrypt::StringFormatterArg::StringFormatterArg(char)’:
/home/zm/instalace/truecrypt-6.1a-source/Main/StringFormatter.h:22: error: ‘StringArg’ was not declared in this scope
/home/zm/instalace/truecrypt-6.1a-source/Main/StringFormatter.h: In constructor ‘TrueCrypt::StringFormatterArg::StringFormatterArg(wchar_t)’:
/home/zm/instalace/truecrypt-6.1a-source/Main/StringFormatter.h:23: error: class ‘TrueCrypt::StringFormatterArg’ does not have any field named ‘StringArg’
/home/zm/instalace/truecrypt-6.1a-source/Main/StringFormatter.h: In constructor ‘TrueCrypt::StringFormatterArg::StringFormatterArg(const char*)’:
/home/zm/instalace/truecrypt-6.1a-source/Main/StringFormatter.h:24: error: class ‘TrueCrypt::StringFormatterArg’ does not have any field named ‘StringArg’
/home/zm/instalace/truecrypt-6.1a-source/Main/StringFormatter.h: In constructor ‘TrueCrypt::StringFormatterArg::StringFormatterArg(const wchar_t*)’:
/home/zm/instalace/truecrypt-6.1a-source/Main/StringFormatter.h:25: error: class ‘TrueCrypt::StringFormatterArg’ does not have any field named ‘StringArg’
/home/zm/instalace/truecrypt-6.1a-source/Main/StringFormatter.h: In constructor ‘TrueCrypt::StringFormatterArg::StringFormatterArg(const std::string&)’:
/home/zm/instalace/truecrypt-6.1a-source/Main/StringFormatter.h:26: error: class ‘TrueCrypt::StringFormatterArg’ does not have any field named ‘StringArg’
/home/zm/instalace/truecrypt-6.1a-source/Main/StringFormatter.h: In constructor ‘TrueCrypt::StringFormatterArg::StringFormatterArg(const std::wstring&)’:
/home/zm/instalace/truecrypt-6.1a-source/Main/StringFormatter.h:27: error: class ‘TrueCrypt::StringFormatterArg’ does not have any field named ‘StringArg’
/home/zm/instalace/truecrypt-6.1a-source/Main/StringFormatter.h: In constructor ‘TrueCrypt::StringFormatterArg::StringFormatterArg(int)’:
/home/zm/instalace/truecrypt-6.1a-source/Main/StringFormatter.h:28: error: class ‘TrueCrypt::StringFormatterArg’ does not have any field named ‘StringArg’
/home/zm/instalace/truecrypt-6.1a-source/Main/StringFormatter.h:28: error: ‘str’ was not declared in this scope
/home/zm/instalace/truecrypt-6.1a-source/Main/StringFormatter.h: In constructor ‘TrueCrypt::StringFormatterArg::StringFormatterArg(TrueCrypt::int32)’:
/home/zm/instalace/truecrypt-6.1a-source/Main/StringFormatter.h:29: error: class ‘TrueCrypt::StringFormatterArg’ does not have any field named ‘StringArg’
/home/zm/instalace/truecrypt-6.1a-source/Main/StringFormatter.h: In constructor ‘TrueCrypt::StringFormatterArg::StringFormatterArg(TrueCrypt::uint32)’:
/home/zm/instalace/truecrypt-6.1a-source/Main/StringFormatter.h:30: error: class ‘TrueCrypt::StringFormatterArg’ does not have any field named ‘StringArg’
/home/zm/instalace/truecrypt-6.1a-source/Main/StringFormatter.h: In constructor ‘TrueCrypt::StringFormatterArg::StringFormatterArg(TrueCrypt::int64)’:
/home/zm/instalace/truecrypt-6.1a-source/Main/StringFormatter.h:31: error: class ‘TrueCrypt::StringFormatterArg’ does not have any field named ‘StringArg’
/home/zm/instalace/truecrypt-6.1a-source/Main/StringFormatter.h: In constructor ‘TrueCrypt::StringFormatterArg::StringFormatterArg(TrueCrypt::uint64)’:
/home/zm/instalace/truecrypt-6.1a-source/Main/StringFormatter.h:32: error: class ‘TrueCrypt::StringFormatterArg’ does not have any field named ‘StringArg’
/home/zm/instalace/truecrypt-6.1a-source/Main/StringFormatter.h: At global scope:
/home/zm/instalace/truecrypt-6.1a-source/Main/StringFormatter.h:48: error: expected ‘,’ or ‘...’ before ‘&’ token
/home/zm/instalace/truecrypt-6.1a-source/Main/StringFormatter.h:48: error: ISO C++ forbids declaration of ‘wxString’ with no type
/home/zm/instalace/truecrypt-6.1a-source/Main/StringFormatter.h:52: error: expected type-specifier before ‘wxString’
/home/zm/instalace/truecrypt-6.1a-source/Main/StringFormatter.h:56: error: ‘wxString’ does not name a type
/home/zm/instalace/truecrypt-6.1a-source/Main/StringFormatter.h: In member function ‘TrueCrypt::StringFormatter::operator std::wstring() const’:
/home/zm/instalace/truecrypt-6.1a-source/Main/StringFormatter.h:51: error: ‘FormattedString’ was not declared in this scope
/home/zm/instalace/truecrypt-6.1a-source/Main/StringFormatter.h: In member function ‘TrueCrypt::StringFormatter::operator TrueCrypt::StringFormatterArg() const’:
/home/zm/instalace/truecrypt-6.1a-source/Main/StringFormatter.h:53: error: ‘FormattedString’ was not declared in this scope
Hotkey.h: At global scope:
Hotkey.h:37: error: expected ‘,’ or ‘...’ before ‘&’ token
Hotkey.h:37: error: ISO C++ forbids declaration of ‘wxString’ with no type
Hotkey.h:43: error: ‘wxString’ does not name a type
Hotkey.h:44: error: ‘wxString’ does not name a type
Hotkey.h:46: error: ‘wxWindow’ has not been declared
Hotkey.h:48: error: ‘wxWindow’ has not been declared
Hotkey.h:50: error: ‘wxString’ does not name a type
Hotkey.h:57: error: ‘wxString’ does not name a type
Hotkey.h: In constructor ‘TrueCrypt::Hotkey::Hotkey(int, const std::wstring&, int)’:
Hotkey.h:38: error: class ‘TrueCrypt::Hotkey’ does not have any field named ‘Description’
Hotkey.h:38: error: ‘description’ was not declared in this scope
Hotkey.h:38: error: ‘virtualKeyCode’ was not declared in this scope
Hotkey.h:38: error: ‘virtualKeyModifiers’ was not declared in this scope
UserPreferences.h: At global scope:
UserPreferences.h:92: error: ‘wxString’ does not name a type
UserPreferences.h:93: error: ‘wxString’ does not name a type
UserPreferences.h:94: error: expected ‘,’ or ‘...’ before ‘&’ token
UserPreferences.h:94: error: ISO C++ forbids declaration of ‘wxString’ with no type
UserPreferences.h:95: error: expected ‘,’ or ‘...’ before ‘&’ token
UserPreferences.h:95: error: ISO C++ forbids declaration of ‘wxString’ with no type
UserPreferences.h:95: error: ‘void TrueCrypt::UserPreferences::SetValue(int)’ cannot be overloaded
UserPreferences.h:94: error: with ‘void TrueCrypt::UserPreferences::SetValue(int)’
UserPreferences.h:96: error: expected ‘,’ or ‘...’ before ‘&’ token
UserPreferences.h:96: error: ISO C++ forbids declaration of ‘wxString’ with no type
UserPreferences.h:96: error: ‘void TrueCrypt::UserPreferences::SetValue(int)’ cannot be overloaded
UserPreferences.h:94: error: with ‘void TrueCrypt::UserPreferences::SetValue(int)’
UserPreferences.h:97: error: expected ‘,’ or ‘...’ before ‘&’ token
UserPreferences.h:97: error: ISO C++ forbids declaration of ‘wxString’ with no type
UserPreferences.h:97: error: ‘void TrueCrypt::UserPreferences::SetValue(int)’ cannot be overloaded
UserPreferences.h:94: error: with ‘void TrueCrypt::UserPreferences::SetValue(int)’
UserPreferences.h:98: error: expected ‘,’ or ‘...’ before ‘&’ token
UserPreferences.h:98: error: ISO C++ forbids declaration of ‘wxString’ with no type
UserPreferences.h:98: error: ‘void TrueCrypt::UserPreferences::SetValue(int)’ cannot be overloaded
UserPreferences.h:94: error: with ‘void TrueCrypt::UserPreferences::SetValue(int)’
UserPreferences.h:99: error: expected ‘,’ or ‘...’ before ‘&’ token
UserPreferences.h:99: error: ISO C++ forbids declaration of ‘wxString’ with no type
UserPreferences.h:99: error: ‘void TrueCrypt::UserPreferences::SetValue(int)’ cannot be overloaded
UserPreferences.h:94: error: with ‘void TrueCrypt::UserPreferences::SetValue(int)’
CommandLineInterface.h:51: error: expected `)' before ‘&’ token
CommandLineInterface.h:80: error: expected ‘,’ or ‘...’ before ‘&’ token
CommandLineInterface.h:80: error: ISO C++ forbids declaration of ‘wxString’ with no type
CommandLineInterface.h:81: error: expected ‘,’ or ‘...’ before ‘&’ token
CommandLineInterface.h:81: error: ISO C++ forbids declaration of ‘wxString’ with no type
FavoriteVolume.h:36: error: ‘wxString’ does not name a type
LanguageStrings.h:23: error: ISO C++ forbids declaration of ‘wxString’ with no type
LanguageStrings.h:23: error: expected ‘;’ before ‘operator’
UserInterfaceException.h:23: error: expected ‘,’ or ‘...’ before ‘&’ token
UserInterfaceException.h:23: error: ISO C++ forbids declaration of ‘wxString’ with no type
UserInterfaceException.h:27: error: expected type-specifier before ‘wxString’
UserInterfaceException.h:30: error: ‘wxString’ does not name a type
UserInterfaceException.h: In constructor ‘TrueCrypt::ErrorMessage::ErrorMessage(const std::string&, int)’:
UserInterfaceException.h:23: error: class ‘TrueCrypt::ErrorMessage’ does not have any field named ‘Text’
UserInterfaceException.h:23: error: ‘errorMessage’ was not declared in this scope
UserInterfaceException.h: In member function ‘TrueCrypt::ErrorMessage::operator std::wstring() const’:
UserInterfaceException.h:26: error: ‘Text’ was not declared in this scope
UserInterface.h: At global scope:
UserInterface.h:25: error: expected class-name before ‘{’ token
UserInterface.h:29: error: expected ‘,’ or ‘...’ before ‘&’ token
UserInterface.h:29: error: ISO C++ forbids declaration of ‘wxString’ with no type
UserInterface.h:42: error: expected ‘,’ or ‘...’ before ‘&’ token
UserInterface.h:42: error: ISO C++ forbids declaration of ‘wxString’ with no type
UserInterface.h:43: error: expected ‘,’ or ‘...’ before ‘&’ token
UserInterface.h:43: error: ISO C++ forbids declaration of ‘wxString’ with no type
UserInterface.h:44: error: expected ‘,’ or ‘...’ before ‘&’ token
UserInterface.h:44: error: ISO C++ forbids declaration of ‘wxString’ with no type
UserInterface.h:45: error: expected ‘,’ or ‘...’ before ‘&’ token
UserInterface.h:45: error: ISO C++ forbids declaration of ‘wxString’ with no type
UserInterface.h:47: error: ‘wxString’ does not name a type
UserInterface.h:63: error: expected ‘,’ or ‘...’ before ‘&’ token
UserInterface.h:63: error: ISO C++ forbids declaration of ‘wxString’ with no type
UserInterface.h:66: error: expected ‘,’ or ‘...’ before ‘&’ token
UserInterface.h:66: error: ISO C++ forbids declaration of ‘wxString’ with no type
UserInterface.h:69: error: expected ‘,’ or ‘...’ before ‘&’ token
UserInterface.h:69: error: ISO C++ forbids declaration of ‘wxString’ with no type
UserInterface.h:70: error: expected ‘,’ or ‘...’ before ‘&’ token
UserInterface.h:70: error: ISO C++ forbids declaration of ‘wxString’ with no type
UserInterface.h:71: error: ‘wxString’ does not name a type
UserInterface.h:72: error: ‘wxString’ does not name a type
UserInterface.h:74: error: ‘wxString’ does not name a type
UserInterface.h:77: error: ‘wxDateTime’ does not name a type
UserInterface.h:78: error: ‘wxString’ does not name a type
UserInterface.h:79: error: ‘wxString’ does not name a type
UserInterface.h:98: error: ‘wxString’ does not name a type
UserInterface.h:99: error: ‘wxString’ does not name a type
UserInterface.h: In member function ‘virtual void TrueCrypt::UserInterface::ShowError(const char*) const’:
UserInterface.h:62: error: no match for ‘operator[]’ in ‘TrueCrypt::LangString[langStringId]’
UserInterface.h: In member function ‘virtual void TrueCrypt::UserInterface::ShowError(int) const’:
UserInterface.h:63: error: ‘message’ was not declared in this scope
UserInterface.h: In member function ‘virtual void TrueCrypt::UserInterface::ShowInfo(const std::exception&) const’:
UserInterface.h:64: error: ‘ExceptionToMessage’ was not declared in this scope
UserInterface.h: In member function ‘virtual void TrueCrypt::UserInterface::ShowInfo(const char*) const’:
UserInterface.h:65: error: no match for ‘operator[]’ in ‘TrueCrypt::LangString[langStringId]’
UserInterface.h: In member function ‘virtual void TrueCrypt::UserInterface::ShowInfo(int) const’:
UserInterface.h:66: error: ‘message’ was not declared in this scope
UserInterface.h: In member function ‘virtual void TrueCrypt::UserInterface::ShowWarning(const std::exception&) const’:
UserInterface.h:67: error: ‘ExceptionToMessage’ was not declared in this scope
UserInterface.h: In member function ‘virtual void TrueCrypt::UserInterface::ShowWarning(const char*) const’:
UserInterface.h:68: error: no match for ‘operator[]’ in ‘TrueCrypt::LangString[langStringId]’
UserInterface.h: In member function ‘virtual void TrueCrypt::UserInterface::ShowString(int) const’:
UserInterface.h:69: error: ‘str’ was not declared in this scope
UserInterface.h: In member function ‘virtual void TrueCrypt::UserInterface::ShowWarning(int) const’:
UserInterface.h:70: error: ‘message’ was not declared in this scope
Application.h: At global scope:
Application.h:21: error: ISO C++ forbids declaration of ‘wxApp’ with no type
Application.h:21: error: expected ‘;’ before ‘*’ token
Application.h:22: error: ISO C++ forbids declaration of ‘wxApp’ with no type
Application.h:22: error: expected ‘;’ before ‘*’ token
Application.h:23: error: expected ‘,’ or ‘...’ before ‘&’ token
Application.h:23: error: ISO C++ forbids declaration of ‘wxString’ with no type
GraphicUserInterface.h:25: error: ‘wxListCtrl’ has not been declared
GraphicUserInterface.h:26: error: ISO C++ forbids declaration of ‘wxMenuItem’ with no type
GraphicUserInterface.h:26: error: ‘wxMenuItem’ declared as a ‘virtual’ field
GraphicUserInterface.h:26: error: expected ‘;’ before ‘*’ token
GraphicUserInterface.h:27: error: expected ‘,’ or ‘...’ before ‘&’ token
GraphicUserInterface.h:27: error: ISO C++ forbids declaration of ‘wxString’ with no type
GraphicUserInterface.h:31: error: ‘wxWindow’ has not been declared
GraphicUserInterface.h:33: error: ISO C++ forbids declaration of ‘wxHyperlinkCtrl’ with no type
GraphicUserInterface.h:33: error: expected ‘;’ before ‘*’ token
GraphicUserInterface.h:36: error: ‘wxListCtrl’ has not been declared
GraphicUserInterface.h:38: error: expected ‘,’ or ‘...’ before ‘&’ token
GraphicUserInterface.h:38: error: ISO C++ forbids declaration of ‘wxString’ with no type
GraphicUserInterface.h:39: error: expected ‘,’ or ‘...’ before ‘&’ token
GraphicUserInterface.h:39: error: ISO C++ forbids declaration of ‘wxString’ with no type
GraphicUserInterface.h:40: error: expected ‘,’ or ‘...’ before ‘&’ token
GraphicUserInterface.h:40: error: ISO C++ forbids declaration of ‘wxString’ with no type
GraphicUserInterface.h:41: error: expected ‘,’ or ‘...’ before ‘&’ token
GraphicUserInterface.h:41: error: ISO C++ forbids declaration of ‘wxString’ with no type
GraphicUserInterface.h:43: error: ‘wxWindow’ has not been declared
GraphicUserInterface.h:44: error: ISO C++ forbids declaration of ‘wxTopLevelWindow’ with no type
GraphicUserInterface.h:44: error: ‘wxTopLevelWindow’ declared as a ‘virtual’ field
GraphicUserInterface.h:44: error: expected ‘;’ before ‘*’ token
GraphicUserInterface.h:46: error: ‘wxWindow’ has not been declared
GraphicUserInterface.h:47: error: ‘wxWindow’ has not been declared
GraphicUserInterface.h:49: error: ‘wxFont’ does not name a type
GraphicUserInterface.h:50: error: ‘wxString’ does not name a type
GraphicUserInterface.h:51: error: ISO C++ forbids declaration of ‘wxFrame’ with no type
GraphicUserInterface.h:51: error: ‘wxFrame’ declared as a ‘virtual’ field
GraphicUserInterface.h:51: error: expected ‘;’ before ‘*’ token
GraphicUserInterface.h:52: error: expected `;' before ‘virtual’
GraphicUserInterface.h:52: error: ‘wxWindow’ has not been declared
GraphicUserInterface.h:53: error: ‘wxListCtrl’ has not been declared
GraphicUserInterface.h:54: error: ‘wxString’ does not name a type
GraphicUserInterface.h:57: error: ‘wxListCtrl’ has not been declared
GraphicUserInterface.h:59: error: expected ‘,’ or ‘...’ before ‘*’ token
GraphicUserInterface.h:59: error: ISO C++ forbids declaration of ‘wxWindow’ with no type
GraphicUserInterface.h:63: error: ‘wxListCtrl’ has not been declared
GraphicUserInterface.h:67: error: ‘wxWindow’ has not been declared
GraphicUserInterface.h:67: error: expected ‘,’ or ‘...’ before ‘&’ token
GraphicUserInterface.h:67: error: ISO C++ forbids declaration of ‘wxFileName’ with no type
GraphicUserInterface.h:68: error: ‘wxWindow’ has not been declared
GraphicUserInterface.h:68: error: expected ‘,’ or ‘...’ before ‘&’ token
GraphicUserInterface.h:68: error: ISO C++ forbids declaration of ‘wxString’ with no type
GraphicUserInterface.h:69: error: ‘wxWindow’ has not been declared
GraphicUserInterface.h:70: error: ‘wxWindow’ has not been declared
GraphicUserInterface.h:72: error: ‘wxWindow’ has not been declared
GraphicUserInterface.h:73: error: ‘wxWindow’ has not been declared
GraphicUserInterface.h:73: error: expected ‘,’ or ‘...’ before ‘&’ token
GraphicUserInterface.h:73: error: ISO C++ forbids declaration of ‘wxString’ with no type
GraphicUserInterface.h:74: error: ‘wxWindow’ has not been declared
GraphicUserInterface.h:74: error: expected ‘,’ or ‘...’ before ‘&’ token
GraphicUserInterface.h:74: error: ISO C++ forbids declaration of ‘wxString’ with no type
GraphicUserInterface.h:75: error: ‘wxWindow’ has not been declared
GraphicUserInterface.h:76: error: ‘wxFrame’ has not been declared
GraphicUserInterface.h:78: error: ‘wxListCtrl’ has not been declared
GraphicUserInterface.h:79: error: ‘wxListCtrl’ has not been declared
GraphicUserInterface.h:80: error: ‘wxListCtrl’ has not been declared
GraphicUserInterface.h:82: error: expected ‘,’ or ‘...’ before ‘&’ token
GraphicUserInterface.h:82: error: ISO C++ forbids declaration of ‘wxString’ with no type
GraphicUserInterface.h:84: error: expected ‘,’ or ‘...’ before ‘&’ token
GraphicUserInterface.h:84: error: ISO C++ forbids declaration of ‘wxString’ with no type
GraphicUserInterface.h:86: error: expected ‘,’ or ‘...’ before ‘&’ token
GraphicUserInterface.h:86: error: ISO C++ forbids declaration of ‘wxString’ with no type
GraphicUserInterface.h:87: error: ‘wxListCtrl’ has not been declared
GraphicUserInterface.h:91: error: ‘wxControlWithItems’ was not declared in this scope
GraphicUserInterface.h:91: error: ‘control’ was not declared in this scope
GraphicUserInterface.h:91: error: expected `;' before ‘const’
GraphicUserInterface.h:98: error: data member ‘GetSelectedData’ cannot be a member template
GraphicUserInterface.h:101: error: ‘wxCloseEvent’ has not been declared
GraphicUserInterface.h:107: error: expected ‘,’ or ‘...’ before ‘&’ token
GraphicUserInterface.h:107: error: ISO C++ forbids declaration of ‘wxString’ with no type
GraphicUserInterface.h:110: error: ISO C++ forbids declaration of ‘wxFrame’ with no type
GraphicUserInterface.h:110: error: expected ‘;’ before ‘*’ token
GraphicUserInterface.h:115: error: ISO C++ forbids declaration of ‘wxFrame’ with no type
GraphicUserInterface.h:115: error: expected ‘;’ before ‘*’ token
GraphicUserInterface.h:116: error: ‘wxSingleInstanceChecker’ was not declared in this scope
GraphicUserInterface.h:116: error: template argument 1 is invalid
GraphicUserInterface.h: In member function ‘virtual void TrueCrypt::GraphicUserInterface::BeginBusyState() const’:
GraphicUserInterface.h:30: error: ‘wxBeginBusyCursor’ was not declared in this scope
GraphicUserInterface.h: In member function ‘virtual void TrueCrypt::GraphicUserInterface::EndBusyState() const’:
GraphicUserInterface.h:42: error: ‘wxEndBusyCursor’ was not declared in this scope
GraphicUserInterface.h: In member function ‘virtual void TrueCrypt::GraphicUserInterface::SetActiveFrame(int*)’:
GraphicUserInterface.h:76: error: ‘ActiveFrame’ was not declared in this scope
GraphicUserInterface.h: In member function ‘virtual void TrueCrypt::GraphicUserInterface::ShowErrorTopMost(char*) const’:
GraphicUserInterface.h:81: error: no match for ‘operator[]’ in ‘TrueCrypt::LangString[langStringId]’
GraphicUserInterface.h: In member function ‘virtual void TrueCrypt::GraphicUserInterface::ShowInfoTopMost(char*) const’:
GraphicUserInterface.h:83: error: no match for ‘operator[]’ in ‘TrueCrypt::LangString[langStringId]’
GraphicUserInterface.h: In member function ‘virtual void TrueCrypt::GraphicUserInterface::ShowWarningTopMost(char*) const’:
GraphicUserInterface.h:85: error: no match for ‘operator[]’ in ‘TrueCrypt::LangString[langStringId]’
GraphicUserInterface.h: At global scope:
GraphicUserInterface.h:126: error: expected `)' before ‘*’ token
GraphicUserInterface.h:136: error: ISO C++ forbids declaration of ‘wxWindow’ with no type
GraphicUserInterface.h:136: error: expected ‘;’ before ‘*’ token
GraphicUserInterface.h: In destructor ‘TrueCrypt::FreezeScope::~FreezeScope()’:
GraphicUserInterface.h:133: error: ‘Window’ was not declared in this scope
GraphicUserInterface.h: At global scope:
GraphicUserInterface.h:139: error: expected constructor, destructor, or type conversion before ‘(’ token
TextUserInterface.h:24: error: expected ‘,’ or ‘...’ before ‘&’ token
TextUserInterface.h:24: error: ISO C++ forbids declaration of ‘wxString’ with no type
TextUserInterface.h:25: error: expected ‘,’ or ‘...’ before ‘&’ token
TextUserInterface.h:25: error: ISO C++ forbids declaration of ‘wxString’ with no type
TextUserInterface.h:26: error: expected ‘,’ or ‘...’ before ‘&’ token
TextUserInterface.h:26: error: ISO C++ forbids declaration of ‘wxString’ with no type
TextUserInterface.h:28: error: expected ‘,’ or ‘...’ before ‘&’ token
TextUserInterface.h:28: error: ISO C++ forbids declaration of ‘wxString’ with no type
TextUserInterface.h:29: error: expected ‘,’ or ‘...’ before ‘&’ token
TextUserInterface.h:29: error: ISO C++ forbids declaration of ‘wxString’ with no type
TextUserInterface.h:30: error: expected ‘,’ or ‘...’ before ‘&’ token
TextUserInterface.h:30: error: ISO C++ forbids declaration of ‘wxString’ with no type
TextUserInterface.h:37: error: expected ‘,’ or ‘...’ before ‘&’ token
TextUserInterface.h:37: error: ISO C++ forbids declaration of ‘wxString’ with no type
TextUserInterface.h:38: error: expected ‘,’ or ‘...’ before ‘&’ token
TextUserInterface.h:38: error: ISO C++ forbids declaration of ‘wxString’ with no type
TextUserInterface.h:39: error: expected ‘,’ or ‘...’ before ‘&’ token
TextUserInterface.h:39: error: ISO C++ forbids declaration of ‘wxString’ with no type
TextUserInterface.h:40: error: expected ‘,’ or ‘...’ before ‘&’ token
TextUserInterface.h:40: error: ISO C++ forbids declaration of ‘wxString’ with no type
TextUserInterface.h:61: error: ‘wxFFileInputStream’ was not declared in this scope
TextUserInterface.h:61: error: template argument 1 is invalid
TextUserInterface.h:62: error: ‘wxTextInputStream’ was not declared in this scope
TextUserInterface.h:62: error: template argument 1 is invalid
TextUserInterface.h:69: error: expected initializer before ‘*’ token
Application.cpp:21: error: expected constructor, destructor, or type conversion before ‘*’ token
Application.cpp:29: error: expected constructor, destructor, or type conversion before ‘*’ token
Application.cpp:37: error: expected ‘,’ or ‘...’ before ‘&’ token
Application.cpp:37: error: ISO C++ forbids declaration of ‘wxString’ with no type
Application.cpp: In static member function ‘static TrueCrypt::FilePath TrueCrypt::Application::GetConfigFilePath(int)’:
Application.cpp:39: error: ‘wxStandardPaths’ was not declared in this scope
Application.cpp:39: error: expected `;' before ‘stdPaths’
Application.cpp:49: error: ‘stdPaths’ was not declared in this scope
Application.cpp:55: error: ‘createConfigDir’ was not declared in this scope
Application.cpp:58: error: ‘configFileName’ was not declared in this scope
Application.cpp:58: error: ‘wxFileName’ was not declared in this scope
Application.cpp: In static member function ‘static TrueCrypt::DirectoryPath TrueCrypt::Application::GetExecutableDirectory()’:
Application.cpp:64: error: ‘wxStandardPaths’ was not declared in this scope
Application.cpp:64: error: ‘wxFileName’ was not declared in this scope
Application.cpp: In static member function ‘static TrueCrypt::FilePath TrueCrypt::Application::GetExecutablePath()’:
Application.cpp:69: error: ‘wxStandardPaths’ was not declared in this scope
Application.cpp: In static member function ‘static void TrueCrypt::Application::Initialize(TrueCrypt::UserInterfaceType::Enum)’:
Application.cpp:78: error: ‘wxAppInitializer’ was not declared in this scope
Application.cpp:78: error: expected `;' before ‘wxTheAppInitializer’
Application.cpp:85: error: ‘wxAppInitializer’ was not declared in this scope
Application.cpp:85: error: expected `;' before ‘wxTheAppInitializer’
make[1]: *** [Application.o] Error 1
make: *** [all] Error 2
[zm@localhost truecrypt-6.1a-source]$
21.12.2008 18:03 Ladislav Hagara | skóre: 76 | blog: Ride the Raven
Rozbalit Rozbalit vše Re: Jak se dostat dál s kompilací TrueCryptu?
21.12.2008 21:37 zdenek2008 | skóre: 20
Rozbalit Rozbalit vše Re: Jak se dostat dál s kompilací TrueCryptu?
Díky, teď už to prošlo. Vytvořil se binární soubor ve složce zdrojáků. Asi bych měl nainstalovat kategorii Developer tools v Yum Extenderu, ale s tím se mi možná nainstaluje i hromada balíčků, které nikdy nepoužiju, ne? Ten binární soubor můžu přímo z té složky spustit a otevře se mi TrueCrypt. S ním si úspěšně vytvořím šifrovaný svazek, který pak neotevřu, protože mi program zahlásí "Failed to obtain administrator privileges: sudo: sorry, you must have a tty to run sudo". Tak jdu do souboru /etc/sudoers, ale ten vidím poprvé takže nevím co s ním. Možná bude lepší přemístit binární TrueCrypt do /bin nebo /sbin?
21.12.2008 20:06 Petr Dvořáček
Rozbalit Rozbalit vše Re: Jak se dostat dál s kompilací TrueCryptu?

mas nainstalovano libstdc++ ?

 

PS: kterej blbec dal na tehle web tenhle blbej editor prispevku ?

21.12.2008 21:47 zdenek2008 | skóre: 20
Rozbalit Rozbalit vše Re: Jak se dostat dál s kompilací TrueCryptu?
Mám. Díky, už to funguje.

P.S. Byl to takovej vyšší kudrnatej v kraťasech. Je to nějakej rozdíl než kdyby to byl ten malej plešatej s kšandama?
21.12.2008 20:13 Dan Horák | skóre: 20
Rozbalit Rozbalit vše Re: Jak se dostat dál s kompilací TrueCryptu?

Já bych radši zkusil použít už připravené balíčky z http://www.lfarkas.org/linux/packages/fedora/

21.12.2008 21:38 zdenek2008 | skóre: 20
Rozbalit Rozbalit vše Re: Jak se dostat dál s kompilací TrueCryptu?
O těch jsem bohužel nevěděl.

Založit nové vláknoNahoru

Tiskni Sdílej: Linkuj Jaggni to Vybrali.sme.sk Google Del.icio.us Facebook

ISSN 1214-1267   www.czech-server.cz
© 1999-2015 Nitemedia s. r. o. Všechna práva vyhrazena.