abclinuxu.cz AbcLinuxu.cz itbiz.cz ITBiz.cz HDmag.cz HDmag.cz abcprace.cz AbcPráce.cz
AbcLinuxu hledá autory!
Inzerujte na AbcPráce.cz od 950 Kč
Rozšířené hledání
×
    dnes 20:22 | IT novinky

    Indická společnost eMudhra po bezpečnostním incidentu, tj. kompromitaci soukromých klíčů osmi mezilehlých certifikátů své certifikační autority, opouští globální byznys s SSL/TLS certifikáty.

    Ladislav Hagara | Komentářů: 2
    dnes 15:44 | Bezpečnostní upozornění

    Dle Phoronixu zveřejnila společnost Trend Micro prostřednictvím programu Zero Day Initiative (ZDI) několik hlášení bezpečnostních zranitelností přímo na veřejném mailing listu LKML, přestože některé chyby dosud nemají opravu začleněnou do hlavní větve jádra. Mezi hlášenými problémy jsou dvě zranitelnosti s hodnocením CVSS 9.0, týkající se SMB Direct a KSMBD, které mohou umožnit vzdálené spuštění kódu. Další hlášení se týkají … více »

    vencour | Komentářů: 0
    dnes 15:33 | Nová verze

    Správce hesel KeePassXC byl vydán ve verzi 2.8.0. Přechází na Qt 6, podporuje vkládání hesel s Waylandem, rychlé odemykání pomocí Polkitu nebo možnost nastavení klávesových zkratek (seznam změn).

    ʚĭɞ 🍉 | Komentářů: 0
    dnes 15:22 | Nová verze

    Databáze DuckDB (Wikipedie) byla vydána ve verzi 2.0.0 LTS. S kódovým názvem Cinnamon Teal (čírka skořicová). S vyladěným protokolem Quack.

    Ladislav Hagara | Komentářů: 0
    dnes 11:11 | Bezpečnostní upozornění

    V implementaci Broadcom 802.11 byla zjištěna chyba ve zpracování WPS/EAP, týká se to SDK od roku 2010. Broadcom podle výzkumníka Quentina Kaisera odmítl CVE přidělit. Modemy Huawei a Technicolor jsou používány i v ČR, v LTE routerech, běžných domácích routerech a firemních přístupových bodech, jejich současný počet a zranitelnost konkrétních verzí však zatím neznáme. Více detailů a demo. GitHub / Broadcom 802.11 SDK Detection Toolkit.

    vencour | Komentářů: 2
    dnes 05:11 | Nová verze

    Byla vydána nová verze 10.8 z Debianu vycházející linuxové distribuce DietPi pro (nejenom) jednodeskové počítače. Přehled novinek v poznámkách k vydání. Přibyl balíček DietPi WireGuard.

    Ladislav Hagara | Komentářů: 0
    včera 21:22 | Pozvánky

    Oslavte vydání openSUSE Leap 16.1 s námi v Praze! Ve středu 4. listopadu 2026 (den po vydání Leapu 16.1) vás zveme na malou oslavu vydání openSUSE Leap 16.1 do pražské kanceláře SUSE. Připravili jsme pro vás dvě krátké přednášky: … více »

    lkocman | Komentářů: 1
    včera 16:44 | Bezpečnostní upozornění

    Dle plánu bylo PHP vydáno v nových verzích 8.5.12, 8.4.27, 8.3.36 a 8.2.35. Opraveny jsou kritické zranitelnosti CVE-2026-109618 a CVE-2026-109619 aneb PHP2Shell.

    Ladislav Hagara | Komentářů: 10
    včera 11:55 | Nová verze

    UBports, nadace a komunita kolem Ubuntu pro telefony a tablety Ubuntu Touch, vydala Ubuntu Touch 24.04-2.1 a 24.04-1.5. S opravou kritických zranitelností.

    Ladislav Hagara | Komentářů: 0
    včera 11:33 | IT novinky

    Společnost Škoda Auto zveřejnila na Printables bezplatné 3D modely příslušenství do svých vozů (držáky na nápoje, pomůcky pro vedení kabelů, mincovníky, háčky na USB kabely a čepice pro kapsy na zadních stranách opěradel sedadel, držáky na telefony a úchyty pro horní upevnění bezpečnostních pásů).

    Ladislav Hagara | Komentářů: 11
    Které desktopové prostředí na Linuxu používáte?
     (9%)
     (7%)
     (4%)
     (20%)
     (30%)
     (9%)
     (5%)
     (2%)
     (14%)
     (20%)
    Celkem 2894 hlasů
     Komentářů: 33, poslední 20.10. 23:44
    Rozcestník

    Administrace komentářů

    Jste na stránce určené pro řešení chyb a problémů týkajících se diskusí a komentářů. Můžete zde našim administrátorům reportovat špatně zařazenou či duplicitní diskusi, vulgární či osočující příspěvek a podobně. Děkujeme vám za vaši pomoc, více očí více vidí, společně můžeme udržet vysokou kvalitu AbcLinuxu.cz.

    Příspěvek
    23.2.2007 22:28 nus
    Rozbalit Rozbalit vše Install Ati driver
    Ahojte, prosim o radu

    skompiloval som jadro 2.6.20.1 na slackware 11, a chcem si nainstalovat ati driver ale nejako to skonci na tejto chybe a neviem co s tym :-( keby mi niekto vedel pomoct. Dakujem

    ATI module generator V 2.0 ========================== initializing... cat: /lib/modules/2.6.20.1/build/include/linux/version-*.h: No such file or directory make.sh: line 525: [: =: unary operator expected cleaning... patching 'highmem.h'... assuming new VMA API since we do have kernel 2.6.x... Assuming default VMAP API Assuming default munmap API doing Makefile based build for kernel 2.6.x and higher make -C /lib/modules/2.6.20.1/build SUBDIRS=/lib/modules/fglrx/build_mod/2.6.x modules make[1]: Entering directory `/usr/src/linux-2.6.20.1' CC [M] /lib/modules/fglrx/build_mod/2.6.x/firegl_public.o /lib/modules/fglrx/build_mod/2.6.x/firegl_public.c:204: error: syntax error before "mlock" /lib/modules/fglrx/build_mod/2.6.x/firegl_public.c:206: error: syntax error before "munlock" /lib/modules/fglrx/build_mod/2.6.x/firegl_public.c:211: error: syntax error before "modify_ldt" /lib/modules/fglrx/build_mod/2.6.x/firegl_public.c:238: warning: return type defaults to `int' /lib/modules/fglrx/build_mod/2.6.x/firegl_public.c:238: warning: function declaration isn't a prototype /lib/modules/fglrx/build_mod/2.6.x/firegl_public.c: In function `_syscall3': /lib/modules/fglrx/build_mod/2.6.x/firegl_public.c:238: error: parameter `firegl' is initialized /lib/modules/fglrx/build_mod/2.6.x/firegl_public.c:239: error: parameter `__ke_debuglevel' is initialized /lib/modules/fglrx/build_mod/2.6.x/firegl_public.c:240: error: parameter `__ke_moduleflags' is initialized /lib/modules/fglrx/build_mod/2.6.x/firegl_public.c:243: error: storage class specified for parameter `__mod_author243' /lib/modules/fglrx/build_mod/2.6.x/firegl_public.c:243: error: parameter `__mod_author243' is initialized /lib/modules/fglrx/build_mod/2.6.x/firegl_public.c:243: warning: `__used__' attribute ignored /lib/modules/fglrx/build_mod/2.6.x/firegl_public.c:243: error: section attribute not allowed for '__mod_author243' /lib/modules/fglrx/build_mod/2.6.x/firegl_public.c:244: error: storage class specified for parameter `__mod_description244' /lib/modules/fglrx/build_mod/2.6.x/firegl_public.c:244: error: parameter `__mod_description244' is initialized /lib/modules/fglrx/build_mod/2.6.x/firegl_public.c:244: warning: `__used__' attribute ignored /lib/modules/fglrx/build_mod/2.6.x/firegl_public.c:244: error: section attribute not allowed for '__mod_description244' /lib/modules/fglrx/build_mod/2.6.x/firegl_public.c:248: error: storage class specified for parameter `__check_firegl' /lib/modules/fglrx/build_mod/2.6.x/firegl_public.c:248: warning: `always_inline' attribute ignored /lib/modules/fglrx/build_mod/2.6.x/firegl_public.c:248: error: syntax error before '{' token /lib/modules/fglrx/build_mod/2.6.x/firegl_public.c:248: error: storage class specified for parameter `__param_perm_check_firegl' /lib/modules/fglrx/build_mod/2.6.x/firegl_public.c:248: error: parameter `__param_perm_check_firegl' is initialized /lib/modules/fglrx/build_mod/2.6.x/firegl_public.c:248: error: storage class specified for parameter `__param_str_firegl' /lib/modules/fglrx/build_mod/2.6.x/firegl_public.c:248: error: parameter `__param_str_firegl' is initialized /lib/modules/fglrx/build_mod/2.6.x/firegl_public.c:248: error: storage class specified for parameter `__param_firegl' /lib/modules/fglrx/build_mod/2.6.x/firegl_public.c:248: error: parameter `__param_firegl' is initialized /lib/modules/fglrx/build_mod/2.6.x/firegl_public.c:248: warning: `__used__' attribute ignored /lib/modules/fglrx/build_mod/2.6.x/firegl_public.c:248: error: section attribute not allowed for '__param_firegl' /lib/modules/fglrx/build_mod/2.6.x/firegl_public.c:248: error: alignment may not be specified for '__param_firegl' /lib/modules/fglrx/build_mod/2.6.x/firegl_public.c:248: error: storage class specified for parameter `__mod_firegltype248' /lib/modules/fglrx/build_mod/2.6.x/firegl_public.c:248: error: parameter `__mod_firegltype248' is initialized /lib/modules/fglrx/build_mod/2.6.x/firegl_public.c:248: warning: `__used__' attribute ignored /lib/modules/fglrx/build_mod/2.6.x/firegl_public.c:248: error: section attribute not allowed for '__mod_firegltype248' /lib/modules/fglrx/build_mod/2.6.x/firegl_public.c:251: error: storage class specified for parameter `__mod_license251' /lib/modules/fglrx/build_mod/2.6.x/firegl_public.c:251: error: parameter `__mod_license251' is initialized /lib/modules/fglrx/build_mod/2.6.x/firegl_public.c:251: warning: `__used__' attribute ignored /lib/modules/fglrx/build_mod/2.6.x/firegl_public.c:251: error: section attribute not allowed for '__mod_license251' /lib/modules/fglrx/build_mod/2.6.x/firegl_public.c:257: error: parameter `__ke_UTS_RELEASE' is initialized /lib/modules/fglrx/build_mod/2.6.x/firegl_public.c:258: error: parameter `__ke_PAGE_SHIFT' is initialized /lib/modules/fglrx/build_mod/2.6.x/firegl_public.c:259: error: parameter `__ke_PAGE_SIZE' is initialized /lib/modules/fglrx/build_mod/2.6.x/firegl_public.c:260: error: parameter `__ke_PAGE_MASK' is initialized /lib/modules/fglrx/build_mod/2.6.x/firegl_public.c:261: error: parameter `__ke_LINUX_VERSION_CODE' is initialized /lib/modules/fglrx/build_mod/2.6.x/firegl_public.c:268: error: parameter `__ke_MODVERSIONS_State' is initialized /lib/modules/fglrx/build_mod/2.6.x/firegl_public.c:273: error: parameter `__ke_SMP_State' is initialized /lib/modules/fglrx/build_mod/2.6.x/firegl_public.c:282: error: parameter `__ke_PAE_State' is initialized /lib/modules/fglrx/build_mod/2.6.x/firegl_public.c:293: error: syntax error before '{' token /lib/modules/fglrx/build_mod/2.6.x/firegl_public.c:329: warning: structure defined inside parms /lib/modules/fglrx/build_mod/2.6.x/firegl_public.c:329: error: storage class specified for parameter `device_t' /lib/modules/fglrx/build_mod/2.6.x/firegl_public.c:331: warning: type defaults to `int' in declaration of `device_t' /lib/modules/fglrx/build_mod/2.6.x/firegl_public.c:331: error: storage class specified for parameter `device_t' /lib/modules/fglrx/build_mod/2.6.x/firegl_public.c:331: error: conflicting types for 'device_t' /lib/modules/fglrx/build_mod/2.6.x/firegl_public.c:329: error: previous definition of 'device_t' was here /lib/modules/fglrx/build_mod/2.6.x/firegl_public.c:331: error: syntax error before "firegl_public_device" In file included from /lib/modules/fglrx/build_mod/2.6.x/firegl_public.c:337: /lib/modules/fglrx/build_mod/2.6.x/drm.h:104: error: storage class specified for parameter `drm_handle_t' /lib/modules/fglrx/build_mod/2.6.x/drm.h:105: error: storage class specified for parameter `drm_context_t' /lib/modules/fglrx/build_mod/2.6.x/drm.h:106: error: storage class specified for parameter `drm_drawable_t' /lib/modules/fglrx/build_mod/2.6.x/drm.h:107: error: storage class specified for parameter `drm_magic_t' /lib/modules/fglrx/build_mod/2.6.x/drm.h:124: warning: structure defined inside parms /lib/modules/fglrx/build_mod/2.6.x/drm.h:124: error: storage class specified for parameter `drm_clip_rect_t' /lib/modules/fglrx/build_mod/2.6.x/drm.h:136: warning: structure defined inside parms /lib/modules/fglrx/build_mod/2.6.x/drm.h:136: error: storage class specified for parameter `drm_tex_region_t' /lib/modules/fglrx/build_mod/2.6.x/drm.h:148: warning: structure defined inside parms /lib/modules/fglrx/build_mod/2.6.x/drm.h:148: error: storage class specified for parameter `drm_hw_lock_t' /lib/modules/fglrx/build_mod/2.6.x/drm.h:182: warning: structure defined inside parms /lib/modules/fglrx/build_mod/2.6.x/drm.h:182: error: storage class specified for parameter `drm_version_t' /lib/modules/fglrx/build_mod/2.6.x/drm.h:193: warning: structure defined inside parms /lib/modules/fglrx/build_mod/2.6.x/drm.h:193: error: storage class specified for parameter `drm_unique_t' /lib/modules/fglrx/build_mod/2.6.x/drm.h:199: error: syntax error before "drm_version_t" /lib/modules/fglrx/build_mod/2.6.x/drm.h:199: warning: no semicolon at end of struct or union /lib/modules/fglrx/build_mod/2.6.x/drm.h:205: warning: structure defined inside parms /lib/modules/fglrx/build_mod/2.6.x/drm.h:205: error: storage class specified for parameter `drm_block_t' /lib/modules/fglrx/build_mod/2.6.x/drm.h:219: warning: enum defined inside parms /lib/modules/fglrx/build_mod/2.6.x/drm.h:221: warning: structure defined inside parms /lib/modules/fglrx/build_mod/2.6.x/drm.h:221: error: storage class specified for parameter `drm_control_t' /lib/modules/fglrx/build_mod/2.6.x/drm.h:233: warning: enum defined inside parms /lib/modules/fglrx/build_mod/2.6.x/drm.h:233: error: storage class specified for parameter `drm_map_type_t' /lib/modules/fglrx/build_mod/2.6.x/drm.h:247: warning: enum defined inside parms /lib/modules/fglrx/build_mod/2.6.x/drm.h:247: error: storage class specified for parameter `drm_map_flags_t' /lib/modules/fglrx/build_mod/2.6.x/drm.h:253: warning: structure defined inside parms /lib/modules/fglrx/build_mod/2.6.x/drm.h:253: error: storage class specified for parameter `drm_ctx_priv_map_t' /lib/modules/fglrx/build_mod/2.6.x/drm.h:265: error: syntax error before "drm_map_type_t" /lib/modules/fglrx/build_mod/2.6.x/drm.h:265: warning: no semicolon at end of struct or union /lib/modules/fglrx/build_mod/2.6.x/drm.h:271: error: syntax error before '}' token /lib/modules/fglrx/build_mod/2.6.x/drm.h:284: warning: structure defined inside parms /lib/modules/fglrx/build_mod/2.6.x/drm.h:284: error: storage class specified for parameter `drm_client_t' /lib/modules/fglrx/build_mod/2.6.x/drm.h:306: warning: enum defined inside parms /lib/modules/fglrx/build_mod/2.6.x/drm.h:306: error: storage class specified for parameter `drm_stat_type_t' /lib/modules/fglrx/build_mod/2.6.x/drm.h:316: error: syntax error before "drm_stat_type_t" /lib/modules/fglrx/build_mod/2.6.x/drm.h:316: warning: no semicolon at end of struct or union /lib/modules/fglrx/build_mod/2.6.x/drm.h:316: warning: no semicolon at end of struct or union /lib/modules/fglrx/build_mod/2.6.x/drm.h:334: warning: enum defined inside parms /lib/modules/fglrx/build_mod/2.6.x/drm.h:334: error: storage class specified for parameter `drm_lock_flags_t' /lib/modules/fglrx/build_mod/2.6.x/drm.h:344: error: syntax error before "drm_lock_flags_t" /lib/modules/fglrx/build_mod/2.6.x/drm.h:344: warning: no semicolon at end of struct or union /lib/modules/fglrx/build_mod/2.6.x/drm.h:375: warning: enum defined inside parms /lib/modules/fglrx/build_mod/2.6.x/drm.h:375: error: storage class specified for parameter `drm_dma_flags_t' /lib/modules/fglrx/build_mod/2.6.x/drm.h:392: warning: enum defined inside parms /lib/modules/fglrx/build_mod/2.6.x/drm.h:397: warning: structure defined inside parms /lib/modules/fglrx/build_mod/2.6.x/drm.h:397: error: storage class specified for parameter `drm_buf_desc_t' /lib/modules/fglrx/build_mod/2.6.x/drm.h:405: error: syntax error before "drm_buf_desc_t" /lib/modules/fglrx/build_mod/2.6.x/drm.h:405: warning: no semicolon at end of struct or union /lib/modules/fglrx/build_mod/2.6.x/drm.h:415: warning: structure defined inside parms /lib/modules/fglrx/build_mod/2.6.x/drm.h:415: error: storage class specified for parameter `drm_buf_free_t' /lib/modules/fglrx/build_mod/2.6.x/drm.h:428: warning: structure defined inside parms /lib/modules/fglrx/build_mod/2.6.x/drm.h:428: error: storage class specified for parameter `drm_buf_pub_t' /lib/modules/fglrx/build_mod/2.6.x/drm.h:437: error: syntax error before "drm_buf_pub_t" /lib/modules/fglrx/build_mod/2.6.x/drm.h:437: warning: no semicolon at end of struct or union /lib/modules/fglrx/build_mod/2.6.x/drm.h:453: error: syntax error before "drm_dma_flags_t" /lib/modules/fglrx/build_mod/2.6.x/drm.h:453: warning: no semicolon at end of struct or union /lib/modules/fglrx/build_mod/2.6.x/drm.h:459: error: syntax error before '}' token /lib/modules/fglrx/build_mod/2.6.x/drm.h:465: warning: enum defined inside parms /lib/modules/fglrx/build_mod/2.6.x/drm.h:465: error: storage class specified for parameter `drm_ctx_flags_t' /lib/modules/fglrx/build_mod/2.6.x/drm.h:474: error: syntax error before "drm_context_t" /lib/modules/fglrx/build_mod/2.6.x/drm.h:474: warning: no semicolon at end of struct or union /lib/modules/fglrx/build_mod/2.6.x/drm.h:484: error: syntax error before "drm_ctx_t" /lib/modules/fglrx/build_mod/2.6.x/drm.h:484: warning: no semicolon at end of struct or union /lib/modules/fglrx/build_mod/2.6.x/drm.h:492: error: syntax error before "drm_drawable_t" /lib/modules/fglrx/build_mod/2.6.x/drm.h:492: warning: no semicolon at end of struct or union /lib/modules/fglrx/build_mod/2.6.x/drm.h:500: error: syntax error before "drm_magic_t" /lib/modules/fglrx/build_mod/2.6.x/drm.h:500: warning: no semicolon at end of struct or union /lib/modules/fglrx/build_mod/2.6.x/drm.h:514: warning: structure defined inside parms /lib/modules/fglrx/build_mod/2.6.x/drm.h:514: error: storage class specified for parameter `drm_irq_busid_t' /lib/modules/fglrx/build_mod/2.6.x/drm.h:521: warning: enum defined inside parms /lib/modules/fglrx/build_mod/2.6.x/drm.h:521: error: storage class specified for parameter `drm_vblank_seq_type_t' /lib/modules/fglrx/build_mod/2.6.x/drm.h:528: error: syntax error before "drm_vblank_seq_type_t" /lib/modules/fglrx/build_mod/2.6.x/drm.h:528: warning: no semicolon at end of struct or union /lib/modules/fglrx/build_mod/2.6.x/drm.h:531: error: syntax error before '}' token /lib/modules/fglrx/build_mod/2.6.x/drm.h:535: error: syntax error before "drm_vblank_seq_type_t" /lib/modules/fglrx/build_mod/2.6.x/drm.h:535: warning: no semicolon at end of struct or union /lib/modules/fglrx/build_mod/2.6.x/drm.h:536: error: redefinition of parameter 'sequence' /lib/modules/fglrx/build_mod/2.6.x/drm.h:529: error: previous definition of 'sequence' was here /lib/modules/fglrx/build_mod/2.6.x/drm.h:539: error: syntax error before '}' token /lib/modules/fglrx/build_mod/2.6.x/drm.h:548: error: field `request' has incomplete type /lib/modules/fglrx/build_mod/2.6.x/drm.h:549: error: field `reply' has incomplete type /lib/modules/fglrx/build_mod/2.6.x/drm.h:550: warning: union defined inside parms /lib/modules/fglrx/build_mod/2.6.x/drm.h:550: error: storage class specified for parameter `drm_wait_vblank_t' /lib/modules/fglrx/build_mod/2.6.x/drm.h:560: warning: structure defined inside parms /lib/modules/fglrx/build_mod/2.6.x/drm.h:560: error: storage class specified for parameter `drm_agp_mode_t' /lib/modules/fglrx/build_mod/2.6.x/drm.h:573: warning: structure defined inside parms /lib/modules/fglrx/build_mod/2.6.x/drm.h:573: error: storage class specified for parameter `drm_agp_buffer_t' /lib/modules/fglrx/build_mod/2.6.x/drm.h:584: warning: structure defined inside parms /lib/modules/fglrx/build_mod/2.6.x/drm.h:584: error: storage class specified for parameter `drm_agp_binding_t' /lib/modules/fglrx/build_mod/2.6.x/drm.h:606: warning: structure defined inside parms /lib/modules/fglrx/build_mod/2.6.x/drm.h:606: error: storage class specified for parameter `drm_agp_info_t' /lib/modules/fglrx/build_mod/2.6.x/drm.h:615: warning: structure defined inside parms /lib/modules/fglrx/build_mod/2.6.x/drm.h:615: error: storage class specified for parameter `drm_scatter_gather_t' /lib/modules/fglrx/build_mod/2.6.x/drm.h:625: warning: structure defined inside parms /lib/modules/fglrx/build_mod/2.6.x/drm.h:625: error: storage class specified for parameter `drm_set_version_t' /lib/modules/fglrx/build_mod/2.6.x/firegl_public.c:343: error: storage class specified for parameter `FGLDRM_mem_info' /lib/modules/fglrx/build_mod/2.6.x/firegl_public.c:343: error: syntax error before '{' token In file included from include/linux/poll.h:4, from /lib/modules/fglrx/build_mod/2.6.x/drmP.h:82, from /lib/modules/fglrx/build_mod/2.6.x/drm_proc.h:41, from /lib/modules/fglrx/build_mod/2.6.x/firegl_public.c:353: include/asm/poll.h:25: error: syntax error before '}' token In file included from /lib/modules/fglrx/build_mod/2.6.x/drmP.h:82, from /lib/modules/fglrx/build_mod/2.6.x/drm_proc.h:41, from /lib/modules/fglrx/build_mod/2.6.x/firegl_public.c:353: include/linux/poll.h:24: warning: empty declaration include/linux/poll.h:29: error: storage class specified for parameter `poll_queue_proc' include/linux/poll.h:32: error: syntax error before "poll_queue_proc" include/linux/poll.h:32: warning: no semicolon at end of struct or union include/linux/poll.h:35: error: syntax error before "poll_table" include/linux/poll.h:36: error: storage class specified for parameter `poll_wait' include/linux/poll.h:36: warning: function declaration isn't a prototype include/linux/poll.h:36: warning: `always_inline' attribute ignored include/linux/poll.h:50: error: syntax error before '}' token include/linux/poll.h:56: error: syntax error before "poll_table" include/linux/poll.h:56: warning: no semicolon at end of struct or union include/linux/poll.h:60: error: invalid application of `sizeof' to incomplete type `poll_table_entry' include/linux/poll.h:60: warning: division by zero include/linux/poll.h:61: error: syntax error before '}' token include/linux/poll.h:63: error: storage class specified for parameter `poll_initwait' include/linux/poll.h:64: error: storage class specified for parameter `poll_freewait' include/linux/poll.h:73: warning: structure defined inside parms include/linux/poll.h:73: error: storage class specified for parameter `fd_set_bits' include/linux/poll.h:90: error: storage class specified for parameter `get_fd_set' include/linux/poll.h:90: warning: `always_inline' attribute ignored include/linux/poll.h:90: error: syntax error before '{' token include/linux/poll.h:117: warning: "struct pollfd" declared inside parameter list include/linux/poll.h:117: warning: its scope is only this definition or declaration, which is probably not what you want include/linux/poll.h:117: error: storage class specified for parameter `do_sys_poll' In file included from /lib/modules/fglrx/build_mod/2.6.x/drmP.h:83, from /lib/modules/fglrx/build_mod/2.6.x/drm_proc.h:41, from /lib/modules/fglrx/build_mod/2.6.x/firegl_public.c:353: include/asm/pgalloc.h:18: error: storage class specified for parameter `pgd_alloc' include/asm/pgalloc.h:19: error: storage class specified for parameter `pgd_free' include/asm/pgalloc.h:21: error: storage class specified for parameter `pte_alloc_one_kernel' include/asm/pgalloc.h:22: error: storage class specified for parameter `pte_alloc_one' include/asm/pgalloc.h:25: error: storage class specified for parameter `pte_free_kernel' include/asm/pgalloc.h:25: warning: `always_inline' attribute ignored include/asm/pgalloc.h:25: error: syntax error before '{' token In file included from /lib/modules/fglrx/build_mod/2.6.x/drm_proc.h:41, from /lib/modules/fglrx/build_mod/2.6.x/firegl_public.c:353: /lib/modules/fglrx/build_mod/2.6.x/drmP.h:327: error: syntax error before "drm_ioctl_t" /lib/modules/fglrx/build_mod/2.6.x/drmP.h:327: warning: no semicolon at end of struct or union /lib/modules/fglrx/build_mod/2.6.x/drmP.h:330: error: syntax error before '}' token /lib/modules/fglrx/build_mod/2.6.x/drmP.h:334: warning: structure defined inside parms /lib/modules/fglrx/build_mod/2.6.x/drmP.h:334: error: storage class specified for parameter `drm_devstate_t' /lib/modules/fglrx/build_mod/2.6.x/drmP.h:337: error: syntax error before "drm_magic_t" /lib/modules/fglrx/build_mod/2.6.x/drmP.h:337: warning: no semicolon at end of struct or union /lib/modules/fglrx/build_mod/2.6.x/drmP.h:340: error: syntax error before '}' token /lib/modules/fglrx/build_mod/2.6.x/drmP.h:345: warning: structure defined inside parms /lib/modules/fglrx/build_mod/2.6.x/drmP.h:345: error: storage class specified for parameter `drm_magic_head_t' /lib/modules/fglrx/build_mod/2.6.x/drmP.h:351: warning: structure defined inside parms /lib/modules/fglrx/build_mod/2.6.x/drmP.h:351: error: storage class specified for parameter `drm_vma_entry_t' /lib/modules/fglrx/build_mod/2.6.x/drmP.h:378: warning: enum defined inside parms /lib/modules/fglrx/build_mod/2.6.x/drmP.h:382: warning: structure defined inside parms /lib/modules/fglrx/build_mod/2.6.x/drmP.h:382: error: storage class specified for parameter `drm_buf_t' /lib/modules/fglrx/build_mod/2.6.x/drmP.h:388: error: syntax error before "drm_buf_t" /lib/modules/fglrx/build_mod/2.6.x/drmP.h:388: warning: no semicolon at end of struct or union /lib/modules/fglrx/build_mod/2.6.x/drmP.h:394: error: syntax error before '}' token /lib/modules/fglrx/build_mod/2.6.x/drmP.h:399: error: syntax error before "drm_buf_t" /lib/modules/fglrx/build_mod/2.6.x/drmP.h:399: warning: no semicolon at end of struct or union /lib/modules/fglrx/build_mod/2.6.x/drmP.h:406: error: syntax error before '}' token /lib/modules/fglrx/build_mod/2.6.x/drmP.h:414: error: syntax error before "drm_buf_t" /lib/modules/fglrx/build_mod/2.6.x/drmP.h:414: warning: no semicolon at end of struct or union /lib/modules/fglrx/build_mod/2.6.x/drmP.h:419: error: syntax error before "drm_freelist_t" /lib/modules/fglrx/build_mod/2.6.x/drmP.h:428: error: syntax error before "drm_magic_t" /lib/modules/fglrx/build_mod/2.6.x/drmP.h:428: warning: no semicolon at end of struct or union /lib/modules/fglrx/build_mod/2.6.x/drmP.h:430: error: conflicting types for 'next' /lib/modules/fglrx/build_mod/2.6.x/drmP.h:339: error: previous definition of 'next' was here /lib/modules/fglrx/build_mod/2.6.x/drmP.h:438: error: syntax error before '}' token /lib/modules/fglrx/build_mod/2.6.x/drmP.h:454: error: syntax error before "drm_ctx_flags_t" /lib/modules/fglrx/build_mod/2.6.x/drmP.h:454: warning: no semicolon at end of struct or union /lib/modules/fglrx/build_mod/2.6.x/drmP.h:457: error: syntax error before '}' token /lib/modules/fglrx/build_mod/2.6.x/drmP.h:463: error: syntax error before "drm_hw_lock_t" /lib/modules/fglrx/build_mod/2.6.x/drmP.h:463: warning: no semicolon at end of struct or union /lib/modules/fglrx/build_mod/2.6.x/drmP.h:467: error: syntax error before '}' token /lib/modules/fglrx/build_mod/2.6.x/drmP.h:474: error: syntax error before "drm_buf_entry_t" /lib/modules/fglrx/build_mod/2.6.x/drmP.h:474: warning: no semicolon at end of struct or union /lib/modules/fglrx/build_mod/2.6.x/drmP.h:476: error: syntax error before "drm_buf_t" /lib/modules/fglrx/build_mod/2.6.x/drmP.h:477: error: redefinition of parameter 'seg_count' /lib/modules/fglrx/build_mod/2.6.x/drmP.h:415: error: previous definition of 'seg_count' was here /lib/modules/fglrx/build_mod/2.6.x/drmP.h:484: warning: enum defined inside parms /lib/modules/fglrx/build_mod/2.6.x/drmP.h:488: error: syntax error before "drm_buf_t" /lib/modules/fglrx/build_mod/2.6.x/drmP.h:491: error: redefinition of parameter 'waiting' /lib/modules/fglrx/build_mod/2.6.x/drmP.h:401: error: previous definition of 'waiting' was here /lib/modules/fglrx/build_mod/2.6.x/drmP.h:493: error: syntax error before '}' token /lib/modules/fglrx/build_mod/2.6.x/drmP.h:535: warning: structure defined inside parms /lib/modules/fglrx/build_mod/2.6.x/drmP.h:535: error: storage class specified for parameter `drm_sg_mem_t' /lib/modules/fglrx/build_mod/2.6.x/drmP.h:539: error: syntax error before "drm_hw_lock_t" /lib/modules/fglrx/build_mod/2.6.x/drmP.h:539: warning: no semicolon at end of struct or union /lib/modules/fglrx/build_mod/2.6.x/drmP.h:547: error: syntax error before "drm_map_t" /lib/modules/fglrx/build_mod/2.6.x/drmP.h:547: warning: no semicolon at end of struct or union /lib/modules/fglrx/build_mod/2.6.x/drmP.h:550: warning: type defaults to `int' in declaration of `drm_map_t' /lib/modules/fglrx/build_mod/2.6.x/drmP.h:550: error: storage class specified for parameter `drm_map_t' /lib/modules/fglrx/build_mod/2.6.x/drmP.h:550: error: syntax error before "drm_local_map_t" /lib/modules/fglrx/build_mod/2.6.x/drmP.h:557: error: syntax error before "drm_context_t" /lib/modules/fglrx/build_mod/2.6.x/drmP.h:557: warning: no semicolon at end of struct or union /lib/modules/fglrx/build_mod/2.6.x/drmP.h:594: error: syntax error before "drm_stat_type_t" /lib/modules/fglrx/build_mod/2.6.x/drmP.h:594: warning: no semicolon at end of struct or union /lib/modules/fglrx/build_mod/2.6.x/drmP.h:600: error: syntax error before "drm_file_t" /lib/modules/fglrx/build_mod/2.6.x/drmP.h:612: error: syntax error before "drm_ctx_list_t" /lib/modules/fglrx/build_mod/2.6.x/drmP.h:616: error: syntax error before "drm_map_t" /lib/modules/fglrx/build_mod/2.6.x/drmP.h:619: error: syntax error before "drm_vma_entry_t" /lib/modules/fglrx/build_mod/2.6.x/drmP.h:628: error: syntax error before "drm_queue_t" /lib/modules/fglrx/build_mod/2.6.x/drmP.h:679: error: syntax error before "drm_sg_mem_t" /lib/modules/fglrx/build_mod/2.6.x/drmP.h:682: error: syntax error before "drm_sigdata_t" /lib/modules/fglrx/build_mod/2.6.x/drmP.h:684: error: syntax error before '}' token /lib/modules/fglrx/build_mod/2.6.x/drmP.h:692: error: storage class specified for parameter `FGLDRM_flags' /lib/modules/fglrx/build_mod/2.6.x/drmP.h:693: error: storage class specified for parameter `FGLDRM_parse_options' /lib/modules/fglrx/build_mod/2.6.x/drmP.h:694: error: storage class specified for parameter `FGLDRM_cpu_valid' /lib/modules/fglrx/build_mod/2.6.x/drmP.h:698: error: storage class specified for parameter `FGLDRM_version' /lib/modules/fglrx/build_mod/2.6.x/drmP.h:699: error: storage class specified for parameter `FGLDRM_open' /lib/modules/fglrx/build_mod/2.6.x/drmP.h:700: error: storage class specified for parameter `FGLDRM_release' /lib/modules/fglrx/build_mod/2.6.x/drmP.h:702: error: storage class specified for parameter `FGLDRM_ioctl' /lib/modules/fglrx/build_mod/2.6.x/drmP.h:704: error: storage class specified for parameter `FGLDRM_lock' /lib/modules/fglrx/build_mod/2.6.x/drmP.h:706: error: storage class specified for parameter `FGLDRM_unlock' /lib/modules/fglrx/build_mod/2.6.x/drmP.h:707: error: storage class specified for parameter `FGLDRM_fb_loaded' /lib/modules/fglrx/build_mod/2.6.x/drmP.h:711: error: syntax error before "drm_device_t" /lib/modules/fglrx/build_mod/2.6.x/drmP.h:711: error: storage class specified for parameter `FGLDRM_open_helper' /lib/modules/fglrx/build_mod/2.6.x/drmP.h:711: warning: function declaration isn't a prototype /lib/modules/fglrx/build_mod/2.6.x/drmP.h:712: error: storage class specified for parameter `FGLDRM_flush' /lib/modules/fglrx/build_mod/2.6.x/drmP.h:713: error: storage class specified for parameter `FGLDRM_fasync' /lib/modules/fglrx/build_mod/2.6.x/drmP.h:716: error: storage class specified for parameter `FGLDRM_vm_open' /lib/modules/fglrx/build_mod/2.6.x/drmP.h:717: error: storage class specified for parameter `FGLDRM_vm_close' /lib/modules/fglrx/build_mod/2.6.x/drmP.h:718: error: storage class specified for parameter `FGLDRM_vm_shm_close' /lib/modules/fglrx/build_mod/2.6.x/drmP.h:720: error: storage class specified for parameter `FGLDRM_mmap_dma' /lib/modules/fglrx/build_mod/2.6.x/drmP.h:721: error: storage class specified for parameter `FGLDRM_mmap' /lib/modules/fglrx/build_mod/2.6.x/drmP.h:722: error: storage class specified for parameter `FGLDRM_poll' /lib/modules/fglrx/build_mod/2.6.x/drmP.h:723: error: storage class specified for parameter `FGLDRM_read' /lib/modules/fglrx/build_mod/2.6.x/drmP.h:726: error: storage class specified for parameter `FGLDRM_mem_init' /lib/modules/fglrx/build_mod/2.6.x/drmP.h:728: error: storage class specified for parameter `FGLDRM_mem_info' /lib/modules/fglrx/build_mod/2.6.x/drmP.h:728: error: redefinition of parameter 'FGLDRM_mem_info' /lib/modules/fglrx/build_mod/2.6.x/firegl_public.c:343: error: previous definition of 'FGLDRM_mem_info' was here /lib/modules/fglrx/build_mod/2.6.x/drmP.h:729: error: storage class specified for parameter `FGLDRM_alloc' /lib/modules/fglrx/build_mod/2.6.x/drmP.h:730: error: storage class specified for parameter `FGLDRM_calloc' /lib/modules/fglrx/build_mod/2.6.x/drmP.h:732: error: storage class specified for parameter `FGLDRM_realloc' /lib/modules/fglrx/build_mod/2.6.x/drmP.h:733: error: storage class specified for parameter `FGLDRM_free' /lib/modules/fglrx/build_mod/2.6.x/drmP.h:734: error: storage class specified for parameter `FGLDRM_alloc_pages' /lib/modules/fglrx/build_mod/2.6.x/drmP.h:736: error: storage class specified for parameter `FGLDRM_free_pages' /lib/modules/fglrx/build_mod/2.6.x/drmP.h:737: error: syntax error before "drm_device_t" /lib/modules/fglrx/build_mod/2.6.x/drmP.h:737: error: storage class specified for parameter `FGLDRM_ioremap' /lib/modules/fglrx/build_mod/2.6.x/drmP.h:737: warning: function declaration isn't a prototype /lib/modules/fglrx/build_mod/2.6.x/drmP.h:739: error: syntax error before "drm_device_t" /lib/modules/fglrx/build_mod/2.6.x/drmP.h:739: error: storage class specified for parameter `FGLDRM_ioremap_nocache' /lib/modules/fglrx/build_mod/2.6.x/drmP.h:739: warning: function declaration isn't a prototype /lib/modules/fglrx/build_mod/2.6.x/drmP.h:740: error: syntax error before "drm_device_t" /lib/modules/fglrx/build_mod/2.6.x/drmP.h:740: error: storage class specified for parameter `FGLDRM_ioremapfree' /lib/modules/fglrx/build_mod/2.6.x/drmP.h:740: warning: function declaration isn't a prototype /lib/modules/fglrx/build_mod/2.6.x/drmP.h:751: error: storage class specified for parameter `FGLDRM_irq_by_busid' /lib/modules/fglrx/build_mod/2.6.x/drmP.h:753: error: storage class specified for parameter `FGLDRM_getunique' /lib/modules/fglrx/build_mod/2.6.x/drmP.h:755: error: storage class specified for parameter `FGLDRM_setunique' /lib/modules/fglrx/build_mod/2.6.x/drmP.h:757: error: storage class specified for parameter `FGLDRM_getmap' /lib/modules/fglrx/build_mod/2.6.x/drmP.h:759: error: storage class specified for parameter `FGLDRM_getclient' /lib/modules/fglrx/build_mod/2.6.x/drmP.h:761: error: storage class specified for parameter `FGLDRM_getstats' /lib/modules/fglrx/build_mod/2.6.x/drmP.h:763: error: storage class specified for parameter `FGLDRM_setversion' /lib/modules/fglrx/build_mod/2.6.x/drmP.h:767: error: storage class specified for parameter `FGLDRM_resctx' /lib/modules/fglrx/build_mod/2.6.x/drmP.h:769: error: storage class specified for parameter `FGLDRM_addctx' /lib/modules/fglrx/build_mod/2.6.x/drmP.h:771: error: storage class specified for parameter `FGLDRM_modctx' /lib/modules/fglrx/build_mod/2.6.x/drmP.h:773: error: storage class specified for parameter `FGLDRM_getctx' /lib/modules/fglrx/build_mod/2.6.x/drmP.h:775: error: storage class specified for parameter `FGLDRM_switchctx' /lib/modules/fglrx/build_mod/2.6.x/drmP.h:777: error: storage class specified for parameter `FGLDRM_newctx' /lib/modules/fglrx/build_mod/2.6.x/drmP.h:779: error: storage class specified for parameter `FGLDRM_rmctx' /lib/modules/fglrx/build_mod/2.6.x/drmP.h:781: error: syntax error before '*' token /lib/modules/fglrx/build_mod/2.6.x/drmP.h:781: error: storage class specified for parameter `FGLDRM_context_switch' /lib/modules/fglrx/build_mod/2.6.x/drmP.h:781: warning: function declaration isn't a prototype /lib/modules/fglrx/build_mod/2.6.x/drmP.h:782: error: syntax error before '*' token /lib/modules/fglrx/build_mod/2.6.x/drmP.h:782: error: storage class specified for parameter `FGLDRM_context_switch_complete' /lib/modules/fglrx/build_mod/2.6.x/drmP.h:782: warning: function declaration isn't a prototype /lib/modules/fglrx/build_mod/2.6.x/drmP.h:790: error: storage class specified for parameter `FGLDRM_setsareactx' /lib/modules/fglrx/build_mod/2.6.x/drmP.h:792: error: storage class specified for parameter `FGLDRM_getsareactx' /lib/modules/fglrx/build_mod/2.6.x/drmP.h:796: error: storage class specified for parameter `FGLDRM_adddraw' /lib/modules/fglrx/build_mod/2.6.x/drmP.h:798: error: storage class specified for parameter `FGLDRM_rmdraw' /lib/modules/fglrx/build_mod/2.6.x/drmP.h:802: error: syntax error before '*' token /lib/modules/fglrx/build_mod/2.6.x/drmP.h:803: error: storage class specified for parameter `FGLDRM_add_magic' /lib/modules/fglrx/build_mod/2.6.x/drmP.h:803: warning: function declaration isn't a prototype /lib/modules/fglrx/build_mod/2.6.x/drmP.h:804: error: syntax error before '*' token /lib/modules/fglrx/build_mod/2.6.x/drmP.h:804: error: storage class specified for parameter `FGLDRM_remove_magic' /lib/modules/fglrx/build_mod/2.6.x/drmP.h:804: warning: function declaration isn't a prototype /lib/modules/fglrx/build_mod/2.6.x/drmP.h:806: error: storage class specified for parameter `FGLDRM_getmagic' /lib/modules/fglrx/build_mod/2.6.x/drmP.h:808: error: storage class specified for parameter `FGLDRM_authmagic' /lib/modules/fglrx/build_mod/2.6.x/drmP.h:812: error: storage class specified for parameter `FGLDRM_noop' /lib/modules/fglrx/build_mod/2.6.x/drmP.h:816: error: storage class specified for parameter `FGLDRM_lock_take' /lib/modules/fglrx/build_mod/2.6.x/drmP.h:817: error: syntax error before '*' token /lib/modules/fglrx/build_mod/2.6.x/drmP.h:819: error: storage class specified for parameter `FGLDRM_lock_transfer' /lib/modules/fglrx/build_mod/2.6.x/drmP.h:819: warning: function declaration isn't a prototype /lib/modules/fglrx/build_mod/2.6.x/drmP.h:820: error: syntax error before '*' token /lib/modules/fglrx/build_mod/2.6.x/drmP.h:822: error: storage class specified for parameter `FGLDRM_lock_free' /lib/modules/fglrx/build_mod/2.6.x/drmP.h:822: warning: function declaration isn't a prototype /lib/modules/fglrx/build_mod/2.6.x/drmP.h:823: error: storage class specified for parameter `FGLDRM_notifier' /lib/modules/fglrx/build_mod/2.6.x/drmP.h:826: error: storage class specified for parameter `FGLDRM_order' /lib/modules/fglrx/build_mod/2.6.x/drmP.h:828: error: storage class specified for parameter `FGLDRM_addmap' /lib/modules/fglrx/build_mod/2.6.x/drmP.h:830: error: storage class specified for parameter `FGLDRM_rmmap' /lib/modules/fglrx/build_mod/2.6.x/drmP.h:898: error: syntax error before "drm_device_t" /lib/modules/fglrx/build_mod/2.6.x/drmP.h:898: warning: function declaration isn't a prototype /lib/modules/fglrx/build_mod/2.6.x/drmP.h:902: error: syntax error before '*' token /lib/modules/fglrx/build_mod/2.6.x/drmP.h:905: error: storage class specified for parameter `FGLDRM_proc_init' /lib/modules/fglrx/build_mod/2.6.x/drmP.h:905: warning: function declaration isn't a prototype /lib/modules/fglrx/build_mod/2.6.x/drmP.h:908: error: storage class specified for parameter `FGLDRM_proc_cleanup' /lib/modules/fglrx/build_mod/2.6.x/drmP.h:911: error: syntax error before '*' token /lib/modules/fglrx/build_mod/2.6.x/drmP.h:913: error: storage class specified for parameter `FGLDRM_ati_pcigart_init' /lib/modules/fglrx/build_mod/2.6.x/drmP.h:913: warning: function declaration isn't a prototype /lib/modules/fglrx/build_mod/2.6.x/drmP.h:914: error: syntax error before '*' token /lib/modules/fglrx/build_mod/2.6.x/drmP.h:916: error: storage class specified for parameter `FGLDRM_ati_pcigart_cleanup' /lib/modules/fglrx/build_mod/2.6.x/drmP.h:916: warning: function declaration isn't a prototype /lib/modules/fglrx/build_mod/2.6.x/drmP.h:918: error: syntax error before '*' token /lib/modules/fglrx/build_mod/2.6.x/drmP.h:920: error: storage class specified for parameter `FGLDRM_pci_alloc' /lib/modules/fglrx/build_mod/2.6.x/drmP.h:920: warning: function declaration isn't a prototype /lib/modules/fglrx/build_mod/2.6.x/drmP.h:921: error: syntax error before '*' token /lib/modules/fglrx/build_mod/2.6.x/drmP.h:922: error: storage class specified for parameter `FGLDRM_pci_free' /lib/modules/fglrx/build_mod/2.6.x/drmP.h:922: warning: function declaration isn't a prototype In file included from /lib/modules/fglrx/build_mod/2.6.x/firegl_public.c:353: /lib/modules/fglrx/build_mod/2.6.x/drm_proc.h:44: error: storage class specified for parameter `FGLDRM_name_info' /lib/modules/fglrx/build_mod/2.6.x/drm_proc.h:46: error: storage class specified for parameter `FGLDRM_vm_info' /lib/modules/fglrx/build_mod/2.6.x/drm_proc.h:48: error: storage class specified for parameter `FGLDRM_clients_info' /lib/modules/fglrx/build_mod/2.6.x/drm_proc.h:50: error: storage class specified for parameter `FGLDRM_queues_info' /lib/modules/fglrx/build_mod/2.6.x/drm_proc.h:52: error: storage class specified for parameter `FGLDRM_bufs_info' /lib/modules/fglrx/build_mod/2.6.x/drm_proc.h:55: error: storage class specified for parameter `FGLDRM_vma_info' /lib/modules/fglrx/build_mod/2.6.x/drm_proc.h:64: warning: structure defined inside parms /lib/modules/fglrx/build_mod/2.6.x/drm_proc.h:64: error: parameter `FGLDRM_proc_list' is initialized /lib/modules/fglrx/build_mod/2.6.x/drm_proc.h:65: warning: braces around scalar initializer /lib/modules/fglrx/build_mod/2.6.x/drm_proc.h:65: warning: (near initialization for `FGLDRM_proc_list') /lib/modules/fglrx/build_mod/2.6.x/drm_proc.h:65: warning: initialization from incompatible pointer type /lib/modules/fglrx/build_mod/2.6.x/drm_proc.h:65: warning: excess elements in scalar initializer /lib/modules/fglrx/build_mod/2.6.x/drm_proc.h:65: warning: (near initialization for `FGLDRM_proc_list') /lib/modules/fglrx/build_mod/2.6.x/drm_proc.h:66: warning: braces around scalar initializer /lib/modules/fglrx/build_mod/2.6.x/drm_proc.h:66: warning: (near initialization for `FGLDRM_proc_list') /lib/modules/fglrx/build_mod/2.6.x/drm_proc.h:66: warning: initialization from incompatible pointer type /lib/modules/fglrx/build_mod/2.6.x/drm_proc.h:66: warning: excess elements in scalar initializer /lib/modules/fglrx/build_mod/2.6.x/drm_proc.h:66: warning: (near initialization for `FGLDRM_proc_list') /lib/modules/fglrx/build_mod/2.6.x/drm_proc.h:66: warning: excess elements in scalar initializer /lib/modules/fglrx/build_mod/2.6.x/drm_proc.h:66: warning: (near initialization for `FGLDRM_proc_list') /lib/modules/fglrx/build_mod/2.6.x/drm_proc.h:67: warning: braces around scalar initializer /lib/modules/fglrx/build_mod/2.6.x/drm_proc.h:67: warning: (near initialization for `FGLDRM_proc_list') /lib/modules/fglrx/build_mod/2.6.x/drm_proc.h:67: warning: initialization from incompatible pointer type /lib/modules/fglrx/build_mod/2.6.x/drm_proc.h:67: warning: excess elements in scalar initializer /lib/modules/fglrx/build_mod/2.6.x/drm_proc.h:67: warning: (near initialization for `FGLDRM_proc_list') /lib/modules/fglrx/build_mod/2.6.x/drm_proc.h:67: warning: excess elements in scalar initializer /lib/modules/fglrx/build_mod/2.6.x/drm_proc.h:67: warning: (near initialization for `FGLDRM_proc_list') /lib/modules/fglrx/build_mod/2.6.x/drm_proc.h:68: warning: braces around scalar initializer /lib/modules/fglrx/build_mod/2.6.x/drm_proc.h:68: warning: (near initialization for `FGLDRM_proc_list') /lib/modules/fglrx/build_mod/2.6.x/drm_proc.h:68: warning: initialization from incompatible pointer type /lib/modules/fglrx/build_mod/2.6.x/drm_proc.h:68: warning: excess elements in scalar initializer /lib/modules/fglrx/build_mod/2.6.x/drm_proc.h:68: warning: (near initialization for `FGLDRM_proc_list') /lib/modules/fglrx/build_mod/2.6.x/drm_proc.h:68: warning: excess elements in scalar initializer /lib/modules/fglrx/build_mod/2.6.x/drm_proc.h:68: warning: (near initialization for `FGLDRM_proc_list') /lib/modules/fglrx/build_mod/2.6.x/drm_proc.h:69: warning: braces around scalar initializer /lib/modules/fglrx/build_mod/2.6.x/drm_proc.h:69: warning: (near initialization for `FGLDRM_proc_list') /lib/modules/fglrx/build_mod/2.6.x/drm_proc.h:69: warning: initialization from incompatible pointer type /lib/modules/fglrx/build_mod/2.6.x/drm_proc.h:69: warning: excess elements in scalar initializer /lib/modules/fglrx/build_mod/2.6.x/drm_proc.h:69: warning: (near initialization for `FGLDRM_proc_list') /lib/modules/fglrx/build_mod/2.6.x/drm_proc.h:69: warning: excess elements in scalar initializer /lib/modules/fglrx/build_mod/2.6.x/drm_proc.h:69: warning: (near initialization for `FGLDRM_proc_list') /lib/modules/fglrx/build_mod/2.6.x/drm_proc.h:70: warning: braces around scalar initializer /lib/modules/fglrx/build_mod/2.6.x/drm_proc.h:70: warning: (near initialization for `FGLDRM_proc_list') /lib/modules/fglrx/build_mod/2.6.x/drm_proc.h:70: warning: initialization from incompatible pointer type /lib/modules/fglrx/build_mod/2.6.x/drm_proc.h:70: warning: excess elements in scalar initializer /lib/modules/fglrx/build_mod/2.6.x/drm_proc.h:70: warning: (near initialization for `FGLDRM_proc_list') /lib/modules/fglrx/build_mod/2.6.x/drm_proc.h:70: warning: excess elements in scalar initializer /lib/modules/fglrx/build_mod/2.6.x/drm_proc.h:70: warning: (near initialization for `FGLDRM_proc_list') /lib/modules/fglrx/build_mod/2.6.x/drm_proc.h:72: warning: braces around scalar initializer /lib/modules/fglrx/build_mod/2.6.x/drm_proc.h:72: warning: (near initialization for `FGLDRM_proc_list') /lib/modules/fglrx/build_mod/2.6.x/drm_proc.h:72: warning: initialization from incompatible pointer type /lib/modules/fglrx/build_mod/2.6.x/drm_proc.h:72: warning: excess elements in scalar initializer /lib/modules/fglrx/build_mod/2.6.x/drm_proc.h:72: warning: (near initialization for `FGLDRM_proc_list') /lib/modules/fglrx/build_mod/2.6.x/drm_proc.h:72: warning: excess elements in scalar initializer /lib/modules/fglrx/build_mod/2.6.x/drm_proc.h:72: warning: (near initialization for `FGLDRM_proc_list') /lib/modules/fglrx/build_mod/2.6.x/drm_proc.h:90: error: syntax error before '*' token /lib/modules/fglrx/build_mod/2.6.x/drm_proc.h:93: warning: function declaration isn't a prototype /lib/modules/fglrx/build_mod/2.6.x/drm_proc.h:93: error: redefinition of parameter 'FGLDRM_proc_init' /lib/modules/fglrx/build_mod/2.6.x/drmP.h:905: error: previous definition of 'FGLDRM_proc_init' was here /lib/modules/fglrx/build_mod/2.6.x/drm_proc.h:98: error: syntax error before "if" /lib/modules/fglrx/build_mod/2.6.x/drm_proc.h:146: error: redefinition of parameter 'name' /lib/modules/fglrx/build_mod/2.6.x/drm_proc.h:96: error: previous definition of 'name' was here /lib/modules/fglrx/build_mod/2.6.x/drm_proc.h:148: error: syntax error before "if" /lib/modules/fglrx/build_mod/2.6.x/drm_proc.h:176: error: parameter `len' is initialized /lib/modules/fglrx/build_mod/2.6.x/drm_proc.h:178: error: syntax error before "if" /lib/modules/fglrx/build_mod/2.6.x/drm_proc.h:215: error: parameter `len' is initialized /lib/modules/fglrx/build_mod/2.6.x/drm_proc.h:215: error: redefinition of parameter 'len' /lib/modules/fglrx/build_mod/2.6.x/drm_proc.h:176: error: previous definition of 'len' was here /lib/modules/fglrx/build_mod/2.6.x/drm_proc.h:216: error: syntax error before "drm_map_t" /lib/modules/fglrx/build_mod/2.6.x/drm_proc.h:223: error: parameter `types' is initialized /lib/modules/fglrx/build_mod/2.6.x/drm_proc.h:223: warning: initialization from incompatible pointer type /lib/modules/fglrx/build_mod/2.6.x/drm_proc.h:223: warning: excess elements in scalar initializer /lib/modules/fglrx/build_mod/2.6.x/drm_proc.h:223: warning: (near initialization for `types') /lib/modules/fglrx/build_mod/2.6.x/drm_proc.h:223: warning: excess elements in scalar initializer /lib/modules/fglrx/build_mod/2.6.x/drm_proc.h:223: warning: (near initialization for `types') /lib/modules/fglrx/build_mod/2.6.x/drm_proc.h:223: warning: excess elements in scalar initializer /lib/modules/fglrx/build_mod/2.6.x/drm_proc.h:223: warning: (near initialization for `types') /lib/modules/fglrx/build_mod/2.6.x/drm_proc.h:223: warning: excess elements in scalar initializer /lib/modules/fglrx/build_mod/2.6.x/drm_proc.h:223: warning: (near initialization for `types') /lib/modules/fglrx/build_mod/2.6.x/drm_proc.h:225: error: redefinition of parameter 'i' /lib/modules/fglrx/build_mod/2.6.x/drm_proc.h:95: error: previous definition of 'i' was here /lib/modules/fglrx/build_mod/2.6.x/drm_proc.h:227: error: syntax error before "if" /lib/modules/fglrx/build_mod/2.6.x/drm_proc.h:273: error: syntax error before "down" /lib/modules/fglrx/build_mod/2.6.x/drm_proc.h:294: error: parameter `len' is initialized /lib/modules/fglrx/build_mod/2.6.x/drm_proc.h:294: error: redefinition of parameter 'len' /lib/modules/fglrx/build_mod/2.6.x/drm_proc.h:215: error: previous definition of 'len' was here /lib/modules/fglrx/build_mod/2.6.x/drm_proc.h:295: error: redefinition of parameter 'i' /lib/modules/fglrx/build_mod/2.6.x/drm_proc.h:225: error: previous definition of 'i' was here /lib/modules/fglrx/build_mod/2.6.x/drm_proc.h:296: error: syntax error before "drm_queue_t" /lib/modules/fglrx/build_mod/2.6.x/drm_proc.h:341: error: redefinition of parameter 'ret' /lib/modules/fglrx/build_mod/2.6.x/drm_proc.h:271: error: previous definition of 'ret' was here /lib/modules/fglrx/build_mod/2.6.x/drm_proc.h:343: error: syntax error before "down" /lib/modules/fglrx/build_mod/2.6.x/drm_proc.h:364: error: parameter `len' is initialized /lib/modules/fglrx/build_mod/2.6.x/drm_proc.h:364: error: redefinition of parameter 'len' /lib/modules/fglrx/build_mod/2.6.x/drm_proc.h:294: error: previous definition of 'len' was here /lib/modules/fglrx/build_mod/2.6.x/drm_proc.h:365: error: syntax error before "drm_device_dma_t" /lib/modules/fglrx/build_mod/2.6.x/drm_proc.h:366: error: redefinition of parameter 'i' /lib/modules/fglrx/build_mod/2.6.x/drm_proc.h:295: error: previous definition of 'i' was here /lib/modules/fglrx/build_mod/2.6.x/drm_proc.h:368: error: syntax error before "if" /lib/modules/fglrx/build_mod/2.6.x/drm_proc.h:411: error: redefinition of parameter 'ret' /lib/modules/fglrx/build_mod/2.6.x/drm_proc.h:341: error: previous definition of 'ret' was here /lib/modules/fglrx/build_mod/2.6.x/drm_proc.h:413: error: syntax error before "down" /lib/modules/fglrx/build_mod/2.6.x/drm_proc.h:434: error: parameter `len' is initialized /lib/modules/fglrx/build_mod/2.6.x/drm_proc.h:434: error: redefinition of parameter 'len' /lib/modules/fglrx/build_mod/2.6.x/drm_proc.h:364: error: previous definition of 'len' was here /lib/modules/fglrx/build_mod/2.6.x/drm_proc.h:435: error: syntax error before "drm_file_t" /lib/modules/fglrx/build_mod/2.6.x/drm_proc.h:468: error: redefinition of parameter 'ret' /lib/modules/fglrx/build_mod/2.6.x/drm_proc.h:411: error: previous definition of 'ret' was here /lib/modules/fglrx/build_mod/2.6.x/drm_proc.h:470: error: syntax error before "down" /lib/modules/fglrx/build_mod/2.6.x/drm_proc.h:482: error: parameter `len' is initialized /lib/modules/fglrx/build_mod/2.6.x/drm_proc.h:482: error: redefinition of parameter 'len' /lib/modules/fglrx/build_mod/2.6.x/drm_proc.h:434: error: previous definition of 'len' was here /lib/modules/fglrx/build_mod/2.6.x/drm_proc.h:483: error: syntax error before "drm_vma_entry_t" /lib/modules/fglrx/build_mod/2.6.x/drm_proc.h:489: error: syntax error before "if" /lib/modules/fglrx/build_mod/2.6.x/drm_proc.h:539: error: redefinition of parameter 'ret' /lib/modules/fglrx/build_mod/2.6.x/drm_proc.h:468: error: previous definition of 'ret' was here /lib/modules/fglrx/build_mod/2.6.x/drm_proc.h:541: error: syntax error before "down" /lib/modules/fglrx/build_mod/2.6.x/firegl_public.c:371: warning: structure defined inside parms /lib/modules/fglrx/build_mod/2.6.x/firegl_public.c:371: error: storage class specified for parameter `firegl_stub_list_t' /lib/modules/fglrx/build_mod/2.6.x/firegl_public.c:372: warning: type defaults to `int' in declaration of `firegl_stub_list_t' /lib/modules/fglrx/build_mod/2.6.x/firegl_public.c:372: error: storage class specified for parameter `firegl_stub_list_t' /lib/modules/fglrx/build_mod/2.6.x/firegl_public.c:372: error: conflicting types for 'firegl_stub_list_t' /lib/modules/fglrx/build_mod/2.6.x/firegl_public.c:371: error: previous definition of 'firegl_stub_list_t' was here /lib/modules/fglrx/build_mod/2.6.x/firegl_public.c:372: error: syntax error before "firegl_stub_list" /lib/modules/fglrx/build_mod/2.6.x/firegl_public.c:374: error: storage class specified for parameter `firegl_stub_root' /lib/modules/fglrx/build_mod/2.6.x/firegl_public.c:375: error: storage class specified for parameter `firegl_minor' /lib/modules/fglrx/build_mod/2.6.x/firegl_public.c:378: error: syntax error before "device_t" /lib/modules/fglrx/build_mod/2.6.x/firegl_public.c:378: warning: function declar /lib/modules/fglrx/build_mod/2.6.x/firegl_public.c:381: warning: structure defin /lib/modules/fglrx/build_mod/2.6.x/firegl_public.c:381: error: storage class spe /lib/modules/fglrx/build_mod/2.6.x/firegl_public.c:382: warning: type defaults t /lib/modules/fglrx/build_mod/2.6.x/firegl_public.c:382: error: storage class spe /lib/modules/fglrx/build_mod/2.6.x/firegl_public.c:382: error: conflicting types /lib/modules/fglrx/build_mod/2.6.x/firegl_public.c:381: error: previous definiti /lib/modules/fglrx/build_mod/2.6.x/firegl_public.c:382: error: syntax error befo /lib/modules/fglrx/build_mod/2.6.x/firegl_public.c:384: error: storage class spe /lib/modules/fglrx/build_mod/2.6.x/firegl_public.c:387: error: syntax error befo /lib/modules/fglrx/build_mod/2.6.x/firegl_public.c:473: error: parameter `firegl /lib/modules/fglrx/build_mod/2.6.x/firegl_public.c:475: warning: braces around s /lib/modules/fglrx/build_mod/2.6.x/firegl_public.c:475: warning: (near initializ /lib/modules/fglrx/build_mod/2.6.x/firegl_public.c:475: warning: initialization /lib/modules/fglrx/build_mod/2.6.x/firegl_public.c:475: error: `drm_name_info_wr /lib/modules/fglrx/build_mod/2.6.x/firegl_public.c:475: error: (Each undeclared /lib/modules/fglrx/build_mod/2.6.x/firegl_public.c:475: error: for each function /lib/modules/fglrx/build_mod/2.6.x/firegl_public.c:475: confused by earlier erro make[2]: *** [/lib/modules/fglrx/build_mod/2.6.x/firegl_public.o] Error 1 make[1]: *** [_module_/lib/modules/fglrx/build_mod/2.6.x] Error 2 make[1]: Leaving directory `/usr/src/linux-2.6.20.1' make: *** [kmod_build] Error 2 build failed with return value 2

    V tomto formuláři můžete formulovat svou stížnost ohledně příspěvku. Nejprve vyberte typ akce, kterou navrhujete provést s diskusí či příspěvkem. Potom do textového pole napište důvody, proč by měli admini provést vaši žádost, problém nemusí být patrný na první pohled. Odkaz na příspěvek bude přidán automaticky.

    Vaše jméno
    Váš email
    Typ požadavku
    Slovní popis
    ISSN 1214-1267   www.czech-server.cz
    © 1999-2015 Nitemedia s. r. o. Všechna práva vyhrazena.