Ubuntu 27.04 bude Tenacious T-Rex.
Byla vydána nová verze 2026.4.0 "Never-slop" svobodného softwaru ScummVM (Wikipedie) umožňujícího bezproblémový běh mnoha klasických adventur na zařízeních, pro které nebyly nikdy určeny. Přehled novinek v poznámkách k vydání a na GitHubu. ScummVM oslavil 25 let. Verze 0.0.1 vyšla 8. října 2001.
Kanadský vývojář Anthony Sistilli vytvořil ironický DIY projekt parodující kamerové systémy Flock, s cílem názorně demonstrovat rizika masového sledování jaké provozují tyto komerční ALPR systémy. Z levné IP kamery a vlastního ML softwaru (napsaného s pomocí SI circa za 20 minut, kód se mi bohužel nepodařilo dohledat) běžícího v laptopu sestavil jednoduchý systém, který detekuje výhradně policejní vozidla, zaznamenává jejich SPZ a
… více »Část údajů uživatelů internetového supermarketu Rohlík byla odcizena. Kyberútočníci napadli nástroj zákaznické podpory Rohlíku, odcizili tak jména, e-mailové adresy, v některých případech také telefonní čísla nebo přepisy komunikace mezi klienty a zákaznickou podporou. Rohlík incident nahlásil příslušným orgánům a přijal příslušné opatření, aby zamezil podobným případům v budoucnosti, uvedla firma.
Aplikace eDoklady fungovala v obou volebních dnech stabilně a prakticky bez front. Digitální a informační agentura (DIA) odhaduje, že se digitálním dokladem prokázalo více než 100.000 voličů. Aplikaci si před volbami či během nich aktualizovalo 247.517 uživatelů. Nových registrací bylo 19.431 a do aplikace se přihlásilo 357.879 lidí. Největší nápor přišel bezprostředně po otevření volebních místností mezi 14. a 16. hodinou, kdy si
… více »Začal semestr, začal i podzim a kromě hub rostou jako po dešti i veřejné dílny v Praze. Nedávno strahováci referovali o hackerspacu Bordel, nyní se otevřela dílna Dejvice Lab jen kousek od ČVUT. Na blížící Virtuální Bastlírně tak uslyšíte nejen report z návštěvy dílny HWLab, ale i řadu novinek, událostí a úsměvných momentů, které se za poslední měsíc ve světě techniky, ale i vědy udály. Připojte se tedy již v úterý 13.10. od 20:00 a zapojte se do
… více »Byl vydán LineageOS 24 (Mastodon). LineageOS (Wikipedie) je svobodný operační systém pro chytré telefony, tablety a set-top boxy založený na Androidu. Jedná se o nástupce CyanogenModu. LineageOS 24 je založený na Androidu 17.
Společnost Valve publikovala na svém GitLabu nákresy a schémata zapojení headsetu Steam Frame. Pro nekomerční účely.
Soutěž Pwn2Own Ireland 2026 skončila 9. října. Bezpečnostní výzkumníci získali celkem 1 262 000 dolarů na odměnách. Během soutěže bylo předvedeno zneužití 98 zero-day zranitelností. Testování zahrnovalo různé kategorie zařízení a software. Výzkumníci předváděli prakticky fungující útoky podle pravidel soutěže. Výsledky následně slouží výrobcům při přípravě oprav. Mezi pokořenými jsou: Samsung Galaxy S26, OpenAI Codex, Oracle Autonomous AI Database, Google Pixel 10, u iPhone 17 neuspěli.
Programovací jazyk Python byl vydán v nové verzi 3.15.0. Podrobný přehled novinek v aktualizované dokumentaci.

/dev/hdxx /mnt/winxp ntfs-fuse fmask=0111,dmask=0 0 0Zdar Max
, takové captive se přes 300KB/s nedostane a to u velkého souboru, když kopíruješ třeba 50 malejch, tak se rychlost pohybuje tak na 1/6, cca 50KB/s, někdy i míň a předpokládám, že to samé je i u paragon, oproti tomu ntfsprogs/fuse jede plnou parou => 10MB/s a i víc ...
kernel-sources, nebo nějakého podobně pojmenovaného.
Při kompilaci se může vyskytnout několik problémů, čekal bych, že instalační skript ovladačů nebude vědět, kde jsou zdrojáky, potom je dobré si přečíst přiložený návod i onen skript a nějak to tam dopsat.
Kompiace nemusí pokračovat úspěšně ani tak, potom je dobré sem poslat chybové hlášky.
Pokud jde o ntfsmount a ntfsprogs, na to je třeba navíc FUSE (Filesystem in Userspace), v novějších jádrech je přiloženo, ve starších ne, ale jistě jde sehnat binární balíček pro jádro vaší distribuce. Pokud ne, ruční kompilace to jistí. (A v tomto případě bývá bezproblémová.
)
A jaký je rozdíl v použitelnosti obou ovladačů? Ovladače od Paragonu běží celé v jádře, zasouvají se tam podobně, jako třeba ovladače od Nvidie, přeloží se jen kousek (rozhraní) oním instalačním skriptem, zbytek se dodává už v binární podobě bez zdrojových textů. Čtení i zápis jsou velmi rychlé (naměřil jsem asi 30 MB/s čtení a 20 MB/s zápis). Zato ntfsmount neuměl (a možná ještě neumí) zakládat nové položky v adresářové struktuře, nebylo proto možné do adresáře zapsat více, než jen několik nových souborů. Jejich velikost však, pokud vím, nebyla a není omezená a rychlost je rovněž velmi dobrá. V jádře běží jen FUSE, ovladač NTFS pro FUSE běží jako uživatelský proces.
[root@fida ntfs]# sh install.sh configure kernel scripts/kconfig/conf -s arch/i386/Kconfig # # using defaults found in .config # CHK include/linux/version.h ufsd driver can be compiled for kernel 2.6.16-1.2096_FC4(2.6.16) We can build module only for 2.6.x kernels Ufsd module was't madekdyz jsem se dival do skriptu, tak chyba nastala pravdepodobne pri provadeni
makev adresari ifslinux, zde je vypis z install.sh(predtim bylo
cd ifslinuxvypis:
make >/dev/null 2>&1
exitCode=$?
case $exitCode in
0)
maked=yes
;;
*)
/bin/echo "Ufsd module was't made"
cd ../
Finalize
exit 1
esac
kdyz jsem zkusil dat make v adresari ifslinux tak to vypsalo tohle:
I'll get kernel includes from /include
gcc -DMODULE -fshort-wchar -DUFSD_NTFS2=1 -DUFSD_NTFS_SECURITY -DUFSD_NTFS_OBJECTID -DNDEBUG -DUFSD_DEVICE=ufsd -DUFSD_READONLY=0 -DKBUILD_BASENAME=_ufsdvfs_ -include fs_conf.h -pipe -Wall -fno-exceptions -Wno-multichar -Wstrict-prototypes -Wno-unknown-pragmas -mpreferred-stack-boundary=2 -march=i686 -mregparm=3 -I /usr/src/linux/include/asm/mach-default -g0 -O2 -fomit-frame-pointer -fno-strict-aliasing -fno-common -c -I /usr/src/linux/include -I "/include" -I/include ufsdvfs.c -o objfre/vfs/ufsdvfs.o
In file included from (command line):1:
./fs_conf.h:56:1: warning: "UFSD_NTFS_SECURITY" redefined
(command line):1:1: warning: this is the location of the previous definition
./fs_conf.h:57:1: warning: "UFSD_NTFS_OBJECTID" redefined
(command line):1:1: warning: this is the location of the previous definition
In file included from /usr/src/linux/include/linux/rwsem.h:27,
from /usr/src/linux/include/asm/semaphore.h:42,
from /usr/src/linux/include/linux/sched.h:20,
from /usr/src/linux/include/linux/module.h:10,
from ufsdvfs.c:31:
/usr/src/linux/include/asm/rwsem.h: In function ‘__down_read’:
/usr/src/linux/include/asm/rwsem.h:105: error: syntax error before ‘_ufsdvfs_’
/usr/src/linux/include/asm/rwsem.h: In function ‘__down_write’:
/usr/src/linux/include/asm/rwsem.h:157: error: syntax error before ‘_ufsdvfs_’
/usr/src/linux/include/asm/rwsem.h: In function ‘__up_read’:
/usr/src/linux/include/asm/rwsem.h:194: error: syntax error before ‘_ufsdvfs_’
/usr/src/linux/include/asm/rwsem.h:188: warning: unused variable ‘tmp’
/usr/src/linux/include/asm/rwsem.h: In function ‘__up_write’:
/usr/src/linux/include/asm/rwsem.h:220: error: syntax error before ‘_ufsdvfs_’
/usr/src/linux/include/asm/rwsem.h: In function ‘__downgrade_write’:
/usr/src/linux/include/asm/rwsem.h:245: error: syntax error before ‘_ufsdvfs_’
In file included from /usr/src/linux/include/linux/sched.h:20,
from /usr/src/linux/include/linux/module.h:10,
from ufsdvfs.c:31:
/usr/src/linux/include/asm/semaphore.h: In function ‘down’:
/usr/src/linux/include/asm/semaphore.h:105: error: syntax error before ‘_ufsdvfs_’
/usr/src/linux/include/asm/semaphore.h: In function ‘down_interruptible’:
/usr/src/linux/include/asm/semaphore.h:130: error: syntax error before ‘_ufsdvfs_’
/usr/src/linux/include/asm/semaphore.h: In function ‘down_trylock’:
/usr/src/linux/include/asm/semaphore.h:155: error: syntax error before ‘_ufsdvfs_’
/usr/src/linux/include/asm/semaphore.h: In function ‘up’:
/usr/src/linux/include/asm/semaphore.h:179: error: syntax error before ‘_ufsdvfs_’
ufsdvfs.c: In function ‘ufsd_readdir’:
ufsdvfs.c:893: warning: implicit declaration of function ‘update_atime’
ufsdvfs.c: In function ‘ufsd_ioctl_probe_buffers’:
ufsdvfs.c:960: warning: implicit declaration of function ‘verify_area’
ufsdvfs.c: In function ‘ufsd_read_inode2’:
ufsdvfs.c:2225: warning: pointer targets in passing argument 15 of ‘UFSDAPI_FileOpen’ differ in signedness
ufsdvfs.c:2225: warning: pointer targets in passing argument 16 of ‘UFSDAPI_FileOpen’ differ in signedness
ufsdvfs.c:2225: warning: pointer targets in passing argument 17 of ‘UFSDAPI_FileOpen’ differ in signedness
ufsdvfs.c: In function ‘ufsd_statfs’:
ufsdvfs.c:2411: warning: pointer targets in passing argument 2 of ‘UFSDAPI_QueryVolumeInfo’ differ in signedness
ufsdvfs.c:2411: warning: pointer targets in passing argument 5 of ‘UFSDAPI_QueryVolumeInfo’ differ in signedness
make: *** [objfre/vfs/ufsdvfs.o] Error 1
u fuse jsem nenasel rpm, tak jsem ho kompiloval rucne, radsi bych ten paragon, vypada lip
diky za pomoc
Tiskni
Sdílej: