Rodina produktů Raspberry Pi se rozšířila o Raspberry Pi Smart Display Module. Deska pro Raspberry Pi Compute Module 5 se zasouvá přímo do displejů dle specifikace Intel SDM. Cena desky je 30 dolarů.
Byla vydána nová verze 2.56.0 distribuovaného systému správy verzí Git. Přispělo 104 vývojářů, z toho 39 nových. Přehled novinek v příspěvku na blogu GitHubu a v poznámkách k vydání.
Hackerská skupina ShinyHunters oznámila průnik do informačních systémů FBI, prostřednictvím zero-day zranitelnosti v platformě Oracle PeopleSoft, kterou úřad využívá mimo jiné pro náborový portál FBIJobs.gov. Útočníci tvrdí, že získali až 3 TB dat o současných i bývalých zaměstnancích a uchazečích o práci. Jako důkaz zveřejnili vzorek přibližně 5 000 záznamů obsahující jména, adresy, telefonní čísla, data narození, čísla
… více »Doba kompilace linuxového jádra se díky rychlejšímu hardwaru a optimalizacím kbuildu snižuje k deseti sekundám. Nejnovější patche Lorenza Stoakse (vznikají i s pomocí SI) zkrátily na testovacím stroji dobu sestavení z dlouhých 22 vteřin na pouhých 15, a to bez použití RAMdisku. Testovací systém tvořily dva procesory AMD EPYC 9575F (oba dohromady poskytují celkem 128 jader a 256 vláken), čtyřiadvacet 64GB DDR5-6400 paměťových modulů a
… více »Před rokem a půl vývojáři postmarketOS informovali, že pro projekt hledají nové jméno. Včera bylo oznámeno: postmarketOS se nově jmenuje Nura.
Hra Factorio dorazila na Printables. Hned teď si můžete stáhnout 65 různých modelů a nechat celou mimozemskou planetu oživnout na svém stole.
GNU Project Debugger aneb GDB byl vydán ve verzi 18.1. Podrobný přehled novinek v souboru NEWS.
Prezident USA Donald Trump během svého projevu na valném shromáždění OSN 22. září 2026 prohlásil, že umělá inteligence 'bude dále oficiálně nazývána superinteligencí', zkráceně SI. Svůj návrh zdůvodnil takto: 'Použití slova artificial činí inteligenci falešnou. Ona falešná není, ve skutečnosti je úžasná'. Zároveň ve svém proslovu prohlásil, že Spojené státy kategoricky odmítají jakékoliv pokusy o vytvoření 'globalistického
… více »Čínská technologická firma Xiaomi představila novou verzi 2.6 svého modelu MiMo, váhy modelů MiMo‑V2.6‑Pro‑RL a MiMo‑V2.6‑Flash‑RL jsou dostupné na HuggingFace pod licencí MIT. Výkonnější varianta Pro má přes bilion parametrů, z toho 42 miliard aktivních, úspornější Flash 309 miliard parametrů, z nichž se při generování aktivuje přibližně 15 miliard. Oba modely mají délku kontextového okna milion tokenů. Tyto MoE modely zvládají
… více »Proběhl Snapdragon Summit 2026. Společnost Qualcomm se mimo jiné pochlubila během Linuxu na čipech Snapdragon X2. Zatím pouze v ranní verzi vhodné pro vývojáře linuxových distribucí a přispěvatele do jádra Linux.
dpkg -i /home/.../linux-sourcejsem ho chtel nainstalovat(rozbalit do /usr/src/l) ale naskoci chyba...
skeletonix@ubuntu:~$ sudo dpkg -i /home/skeletonix/linux-source-2.6.12_2.6.12-9.23_all.deb Password: (Čtu databázi ... nyní je nainstalováno 60080 souborů a adresářů.) Rozbaluji linux-source-2.6.12 (z .../linux-source-2.6.12_2.6.12-9.23_all.deb) ... dpkg-deb (podproces): zkrácené čtení v buffer_copy (nelze zapisovat do roury během kopírování) dpkg-deb: podproces paste vrátil chybový status 2 dpkg: chyba při zpracovávání /home/skeletonix/linux-source-2.6.12_2.6.12-9.23_all.deb (--install): zkrácené čtení v buffer_copy (dpkg-deb během `./usr/src/linux-source-2.6.12.tar.bz2') Při zpracování nastaly chyby: /home/skeletonix/linux-source-2.6.12_2.6.12-9.23_all.deba tak jsem si stahl primo kernel zabalenej a kdyz dam make menuconfig tak se prozmenu ojevi tyto chyby:...
skeletonix@ubuntu:/usr/src/linux-source-2.6.12-2.6.12$ sudo make menuconfig
HOSTCC scripts/basic/fixdep
scripts/basic/fixdep.c:105:23: error: sys/types.h: není souborem ani adresářem
scripts/basic/fixdep.c:106:22: error: sys/stat.h: není souborem ani adresářem
scripts/basic/fixdep.c:107:22: error: sys/mman.h: není souborem ani adresářem
scripts/basic/fixdep.c:108:20: error: unistd.h: není souborem ani adresářem
scripts/basic/fixdep.c:109:19: error: fcntl.h: není souborem ani adresářem
scripts/basic/fixdep.c:110:20: error: string.h: není souborem ani adresářem
scripts/basic/fixdep.c:111:20: error: stdlib.h: není souborem ani adresářem
scripts/basic/fixdep.c:112:19: error: stdio.h: není souborem ani adresářem
In file included from /usr/lib/gcc/i486-linux-gnu/4.0.2/include/syslimits.h:7,
from /usr/lib/gcc/i486-linux-gnu/4.0.2/include/limits.h:11,
from scripts/basic/fixdep.c:113:
/usr/lib/gcc/i486-linux-gnu/4.0.2/include/limits.h:122:61: error: limits.h: není souborem ani adresářem
scripts/basic/fixdep.c:114:19: error: ctype.h: není souborem ani adresářem
scripts/basic/fixdep.c:115:23: error: arpa/inet.h: není souborem ani adresářem
scripts/basic/fixdep.c: In function ‘usage’:
scripts/basic/fixdep.c:129: warning: implicit declaration of function ‘fprintf’
scripts/basic/fixdep.c:129: warning: incompatible implicit declaration of built-in function ‘fprintf’
scripts/basic/fixdep.c:129: error: ‘stderr’ undeclared (first use in this function)
scripts/basic/fixdep.c:129: error: (Each undeclared identifier is reported only once
scripts/basic/fixdep.c:129: error: for each function it appears in.)
scripts/basic/fixdep.c:130: warning: implicit declaration of function ‘exit’
scripts/basic/fixdep.c:130: warning: incompatible implicit declaration of built-in function ‘exit’
scripts/basic/fixdep.c: In function ‘print_cmdline’:
scripts/basic/fixdep.c:135: warning: implicit declaration of function ‘printf’
scripts/basic/fixdep.c:135: warning: incompatible implicit declaration of built-in function ‘printf’
scripts/basic/fixdep.c: At top level:
scripts/basic/fixdep.c:138: error: ‘NULL’ undeclared here (not in a function)
scripts/basic/fixdep.c: In function ‘grow_config’:
scripts/basic/fixdep.c:151: warning: implicit declaration of function ‘realloc’
scripts/basic/fixdep.c:151: warning: assignment makes pointer from integer without a cast
scripts/basic/fixdep.c:153: warning: implicit declaration of function ‘perror’
scripts/basic/fixdep.c:153: warning: incompatible implicit declaration of built-in function ‘exit’
scripts/basic/fixdep.c: In function ‘is_defined_config’:
scripts/basic/fixdep.c:169: warning: implicit declaration of function ‘memcmp’
scripts/basic/fixdep.c: In function ‘define_config’:
scripts/basic/fixdep.c:182: warning: implicit declaration of function ‘memcpy’
scripts/basic/fixdep.c:182: warning: incompatible implicit declaration of built-in function ‘memcpy’
scripts/basic/fixdep.c: In function ‘use_config’:
scripts/basic/fixdep.c:201: error: ‘PATH_MAX’ undeclared (first use in this function)
scripts/basic/fixdep.c:209: warning: incompatible implicit declaration of built-in function ‘memcpy’
scripts/basic/fixdep.c:215: warning: implicit declaration of function ‘tolower’
scripts/basic/fixdep.c:217: warning: incompatible implicit declaration of built-in function ‘printf’
scripts/basic/fixdep.c:201: warning: unused variable ‘s’
scripts/basic/fixdep.c: At top level:
scripts/basic/fixdep.c:220: error: syntax error before ‘size_t’
scripts/basic/fixdep.c:221: warning: function declaration isn’t a prototype
scripts/basic/fixdep.c: In function ‘parse_config_file’:
scripts/basic/fixdep.c:222: error: ‘map’ undeclared (first use in this function)scripts/basic/fixdep.c:222: error: ‘len’ undeclared (first use in this function)scripts/basic/fixdep.c:228: warning: implicit declaration of function ‘ntohl’
scripts/basic/fixdep.c:239: warning: implicit declaration of function ‘isalnum’
scripts/basic/fixdep.c:245: warning: pointer targets in passing argument 1 of ‘use_config’ differ in signedness
scripts/basic/fixdep.c: In function ‘strrcmp’:
scripts/basic/fixdep.c:252: warning: implicit declaration of function ‘strlen’
scripts/basic/fixdep.c:252: warning: incompatible implicit declaration of built-in function ‘strlen’
scripts/basic/fixdep.c: In function ‘do_config_file’:
scripts/basic/fixdep.c:263: error: storage size of ‘st’ isn’t known
scripts/basic/fixdep.c:267: warning: implicit declaration of function ‘open’
scripts/basic/fixdep.c:267: error: ‘O_RDONLY’ undeclared (first use in this function)
scripts/basic/fixdep.c:269: warning: incompatible implicit declaration of built-in function ‘fprintf’
scripts/basic/fixdep.c:269: error: ‘stderr’ undeclared (first use in this function)
scripts/basic/fixdep.c:271: warning: incompatible implicit declaration of built-in function ‘exit’
scripts/basic/fixdep.c:273: warning: implicit declaration of function ‘fstat’
scripts/basic/fixdep.c:275: warning: implicit declaration of function ‘close’
scripts/basic/fixdep.c:278: warning: implicit declaration of function ‘mmap’
scripts/basic/fixdep.c:278: error: ‘PROT_READ’ undeclared (first use in this function)
scripts/basic/fixdep.c:278: error: ‘MAP_PRIVATE’ undeclared (first use in this function)
scripts/basic/fixdep.c:278: warning: assignment makes pointer from integer without a cast
scripts/basic/fixdep.c:287: warning: implicit declaration of function ‘munmap’
scripts/basic/fixdep.c:263: warning: unused variable ‘st’
scripts/basic/fixdep.c: At top level:
scripts/basic/fixdep.c:292: error: syntax error before ‘size_t’
scripts/basic/fixdep.c:293: warning: function declaration isn’t a prototype
scripts/basic/fixdep.c: In function ‘parse_dep_file’:
scripts/basic/fixdep.c:294: error: ‘map’ undeclared (first use in this function)scripts/basic/fixdep.c:295: error: ‘len’ undeclared (first use in this function)scripts/basic/fixdep.c:297: error: ‘PATH_MAX’ undeclared (first use in this function)
scripts/basic/fixdep.c:299: warning: implicit declaration of function ‘strchr’
scripts/basic/fixdep.c:299: warning: incompatible implicit declaration of built-in function ‘strchr’
scripts/basic/fixdep.c:299: warning: pointer targets in passing argument 1 of ‘strchr’ differ in signedness
scripts/basic/fixdep.c:299: warning: pointer targets in assignment differ in signedness
scripts/basic/fixdep.c:301: warning: incompatible implicit declaration of built-in function ‘fprintf’
scripts/basic/fixdep.c:301: error: ‘stderr’ undeclared (first use in this function)
scripts/basic/fixdep.c:302: warning: incompatible implicit declaration of built-in function ‘exit’
scripts/basic/fixdep.c:304: warning: incompatible implicit declaration of built-in function ‘memcpy’
scripts/basic/fixdep.c:305: warning: incompatible implicit declaration of built-in function ‘printf’
scripts/basic/fixdep.c:297: warning: unused variable ‘s’
scripts/basic/fixdep.c: In function ‘print_deps’:
scripts/basic/fixdep.c:334: error: storage size of ‘st’ isn’t known
scripts/basic/fixdep.c:338: error: ‘O_RDONLY’ undeclared (first use in this function)
scripts/basic/fixdep.c:340: warning: incompatible implicit declaration of built-in function ‘fprintf’
scripts/basic/fixdep.c:340: error: ‘stderr’ undeclared (first use in this function)
scripts/basic/fixdep.c:342: warning: incompatible implicit declaration of built-in function ‘exit’
scripts/basic/fixdep.c:346: warning: incompatible implicit declaration of built-in function ‘fprintf’
scripts/basic/fixdep.c:350: error: ‘PROT_READ’ undeclared (first use in this function)
scripts/basic/fixdep.c:350: error: ‘MAP_PRIVATE’ undeclared (first use in this function)
scripts/basic/fixdep.c:350: warning: assignment makes pointer from integer without a cast
scripts/basic/fixdep.c:334: warning: unused variable ‘st’
scripts/basic/fixdep.c: In function ‘traps’:
scripts/basic/fixdep.c:369: warning: incompatible implicit declaration of built-in function ‘fprintf’
scripts/basic/fixdep.c:369: error: ‘stderr’ undeclared (first use in this function)
scripts/basic/fixdep.c:371: warning: incompatible implicit declaration of built-in function ‘exit’
make[1]: *** [scripts/basic/fixdep] Error 1
make: *** [scripts_basic] Error 2
Nevite prosim nekdo jak to sprovoznit abych mohl skopilovat nove jadro.Byl bych moc vdecen!! Ubuntu 5.10
Dik vsem mno, kernel headers nejsou, ty musim mit nainstalovany abych mohl sprovoznit ten balicek kernel-sources..myslel jsem ze je to vse v tom... Kdyz jsem pod Mandrake stahl vanilla kernel tak jsme ho jen rozbalil a vse je jelo jak ma(make menuconfik,make modules..)!! a pod ubuntu mi to hazi chybu viz vise 1.chyba..
Jak jsme psal potrebuji prekompilovat kernel,potrebuju donej dodat ovladac(modul)pro USB modem(cxacru), nejradej bychto udelal pres balicky kernelu,ale ani primo vanillo jadro mi nejde skompilovat viz 2.chybacd /usr/src wget http://www.kernel.org/pub/linux/kernel/v2.6/linux-2.6.14.tar.bz2 tar xjf linux-2.6.14.tar.bz2 ln -sf linux-2.6.14 linux cd linux make menuconfig make bzImage && make modules && make modules_install cp System.map /boot/System.map-2.6.14 cp arch/i386/boot/bzImage /boot/vmlinuz-2.6.14A pak podle libosti budto rovnou zmena konfigurace lila, nebo nejdriv uprava symlinku /boot/vmlinuz a /boot/vmlinuz.old, abych neprisel o moznost nabootovat puvodni jadro pokud nove jadro z nejakho duvodu nenabootuje, a hotovo...
md5sum balicek_se_zdrojaky_jadra.deb... scripts/basic/fixdep.c:110:20: error: string.h: není souborem ani adresářem scripts/basic/fixdep.c:111:20: error: stdlib.h: není souborem ani adresářem scripts/basic/fixdep.c:112:19: error: stdio.h: není souborem ani adresářem ...Chtělo by si ty hlášky taky přečíst! Tobě nechybí kernel-headers, ale základní systémové hlavičkové soubory! Ovšem Ubuntu neznám, tak nevím, který balík musíš doinstalovat.
skeletonix@ubuntu:/usr/src/linux-source-2.6.12$ sudo make menuconfig /usr/src/linux-source-2.6.12/scripts/gcc-version.sh: line 11: gcc-3.4: command not found /usr/src/linux-source-2.6.12/scripts/gcc-version.sh: line 12: gcc-3.4: command not found HOSTCC scripts/basic/fixdep /bin/sh: gcc-3.4: command not found make[1]: *** [scripts/basic/fixdep] Error 127 make: *** [scripts_basic] Error 2a to gcc mam urcite version 4.00.Nevis co je zapotis tohle?
skeletonix@ubuntu:~$ gcc --version gcc (GCC) 4.0.2 20050808 (prerelease) (Ubuntu 4.0.1-4ubuntu9) Copyright (C) 2005 Free Software Foundation, Inc. This is free software; see the source for copying conditions. There is NO warranty; not even for MERCHANTABILITY or FITNESS FOR A PARTICULAR PURPOSE.jak jsme psal..ale nebezi to porad to pise to same
/bin/sh: gcc-3.4: command not found gcc (GCC) 4.0.2 20050808
LC_MESSAGES="C" sudo dpkg -i /home/skeletonix/linux-source-2.6.12_2.6.12-9.23_all.deb
Sice to zase vyhodí chybu, ale ta bude anglicky a tudíž ji bude možné strčit do Google a prohledat mailing-list Debianu.
(Pokud nebude fungovat "C", dej tam "en_GB" nebo "en_US")
Tiskni
Sdílej: