abclinuxu.cz AbcLinuxu.cz itbiz.cz ITBiz.cz HDmag.cz HDmag.cz abcprace.cz AbcPráce.cz
Inzerujte na AbcPráce.cz od 950 Kč
Rozšířené hledání
×
    dnes 13:00 | Nová verze

    Komunita kolem Linuxu From Scratch (LFS) vydala Linux From Scratch 12.1 a Linux From Scratch 12.1 se systemd. Nové verze knih s návody na instalaci vlastního linuxového systému ze zdrojových kódů přichází s Glibc 2.39, Binutils 2.42 a Linuxem 6.7.4. Současně bylo oznámeno vydání verze 12.1 knih Beyond Linux From Scratch (BLFS) a Beyond Linux From Scratch se systemd.

    Ladislav Hagara | Komentářů: 0
    včera 22:22 | Upozornění

    Google blokuje Chaty RCS (Rich Communication Services neboli rozšířené komunikační služby) na telefonech s rootnutým Androidem nebo odemčeným zavaděčem [9to5Google].

    Ladislav Hagara | Komentářů: 7
    včera 12:22 | Komunita

    Bylo spuštěno hlasování o přednáškách a workshopech pro letošní Installfest, jenž proběhne o víkendu 16. a 17. března v Praze na Karlově náměstí 13. O open source hardwaru bude přednášet Mitch Altman.

    Ladislav Hagara | Komentářů: 1
    včera 08:00 | IT novinky

    Počítač NitroPC Pro 2 od společnosti Nitrokey s corebootem Dasharo byl oficiálně certifikován pro Qubes OS verze 4. Qubes OS (Wikipedie) je svobodný a otevřený operační systém zaměřený na bezpečnost desktopu.

    Ladislav Hagara | Komentářů: 1
    včera 07:00 | Nová verze

    Mobilní operační systém /e/OS (Wikipedie) založený na Androidu / LineageOS, ale bez aplikací a služeb od Googlu, byl vydán ve verzi 1.20. Přehled novinek na GitLabu.

    Ladislav Hagara | Komentářů: 17
    29.2. 13:00 | IT novinky

    Jednodeskový počítač Raspberry Pi slaví 12 let. Prodej byl spuštěn 29. února 2012 (Wikipedie, 𝕏).

    Ladislav Hagara | Komentářů: 13
    29.2. 12:00 | Nová verze

    Byla vydána verze 3.2 multiplatformního integrovaného vývojového prostředí (IDE) pro rychlý vývoj aplikaci (RAD) ve Free Pascalu Lazarus (Wikipedie). Přehled novinek v poznámkách k vydání. Využíván je Free Pascal Compiler (FPC) 3.2.2.

    Ladislav Hagara | Komentářů: 0
    29.2. 11:44 | Nová verze

    Byla vydána nová verze 1.6.0 grafického správce diskových oddílů GParted (GNOME Partition Editor) a také verze 1.6.0 živé distribuce GParted Live, která obsahuje tohoto správce a další nástroje pro zálohování či obnovu dat. Linux byl povýšen na verzi 6.6.15-2.

    Ladislav Hagara | Komentářů: 8
    29.2. 06:00 | Nová verze Ladislav Hagara | Komentářů: 0
    28.2. 22:44 | Nová verze

    Byla vydána (𝕏) únorová aktualizace aneb nová verze 1.87 editoru zdrojových kódů Visual Studio Code (Wikipedie). Přehled novinek i s náhledy a animovanými gify v poznámkách k vydání. Ve verzi 1.87 vyjde také VSCodium, tj. komunitní sestavení Visual Studia Code bez telemetrie a licenčních podmínek Microsoftu.

    Ladislav Hagara | Komentářů: 17
    Steam
     (18%)
     (31%)
     (9%)
     (11%)
     (31%)
    Celkem 55 hlasů
     Komentářů: 0
    Rozcestník

    Dotaz: nejde zkompilovat gnome-base/libglade

    10.10.2007 15:37 IGInek | skóre: 2 | Prušánky
    nejde zkompilovat gnome-base/libglade
    Přečteno: 404×
    Čau, rozhodl jsem se, že se pokusím zprovoznit Xgl a Beryl. Xgl jsem rozchodil, ale nějak jsem se zasekl na kompilaci Berylu. Vyžaduje totiž gnome-base/libglade a ten mi nejde z nějakého záhadného důvodu zkompilovat.

    Kompilace koční chybou:

    In file included from glade-xml.c:32:
    ../glade/glade-private.h:33: error: expected specifier-qualifier-list before 'GtkTooltips'
    glade-xml.c: In function 'glade_xml_init':
    glade-xml.c:122: error: 'GladeXMLPrivate' has no member named 'tooltips'
    glade-xml.c:122: warning: implicit declaration of function 'gtk_tooltips_new'
    glade-xml.c:123: warning: implicit declaration of function 'gtk_tooltips_enable'
    glade-xml.c:123: error: 'GladeXMLPrivate' has no member named 'tooltips'
    glade-xml.c:124: error: 'GladeXMLPrivate' has no member named 'tooltips'
    glade-xml.c:125: error: 'GladeXMLPrivate' has no member named 'name_hash'
    glade-xml.c:126: error: 'GladeXMLPrivate' has no member named 'signals'
    glade-xml.c:127: error: 'GladeXMLPrivate' has no member named 'toplevel'
    glade-xml.c:128: error: 'GladeXMLPrivate' has no member named 'accel_group'
    glade-xml.c:129: error: 'GladeXMLPrivate' has no member named 'default_widget'
    glade-xml.c:130: error: 'GladeXMLPrivate' has no member named 'focus_widget'
    glade-xml.c:131: error: 'GladeXMLPrivate' has no member named 'deferred_props'
    glade-xml.c: In function 'glade_xml_signal_connect':
    glade-xml.c:286: error: 'GladeXMLPrivate' has no member named 'signals'
    glade-xml.c:291: error: 'GladeXMLPrivate' has no member named 'name_hash'
    glade-xml.c: In function 'autoconnect_foreach':
    glade-xml.c:324: error: 'GladeXMLPrivate' has no member named 'name_hash'
    glade-xml.c: In function 'glade_xml_signal_autoconnect':
    glade-xml.c:367: error: 'GladeXMLPrivate' has no member named 'signals'
    glade-xml.c: In function 'autoconnect_full_foreach':
    glade-xml.c:390: error: 'GladeXMLPrivate' has no member named 'name_hash'
    glade-xml.c: In function 'glade_xml_signal_connect_full':
    glade-xml.c:446: error: 'GladeXMLPrivate' has no member named 'signals'
    glade-xml.c: In function 'glade_xml_signal_autoconnect_full':
    glade-xml.c:473: error: 'GladeXMLPrivate' has no member named 'signals'
    glade-xml.c: In function 'glade_xml_get_widget':
    glade-xml.c:548: error: 'GladeXMLPrivate' has no member named 'name_hash'
    glade-xml.c: In function 'glade_xml_get_widget_prefix':
    glade-xml.c:586: error: 'GladeXMLPrivate' has no member named 'name_hash'
    glade-xml.c: In function 'glade_xml_set_toplevel':
    glade-xml.c:669: error: 'GladeXMLPrivate' has no member named 'focus_widget'
    glade-xml.c:670: error: 'GladeXMLPrivate' has no member named 'focus_widget'
    glade-xml.c:671: error: 'GladeXMLPrivate' has no member named 'default_widget'
    glade-xml.c:672: error: 'GladeXMLPrivate' has no member named 'default_widget'
    glade-xml.c:673: error: 'GladeXMLPrivate' has no member named 'focus_widget'
    glade-xml.c:674: error: 'GladeXMLPrivate' has no member named 'default_widget'
    glade-xml.c:675: error: 'GladeXMLPrivate' has no member named 'toplevel'
    glade-xml.c:677: error: 'GladeXMLPrivate' has no member named 'accel_group'
    glade-xml.c:678: error: 'GladeXMLPrivate' has no member named 'accel_group'
    glade-xml.c:679: error: 'GladeXMLPrivate' has no member named 'accel_group'
    glade-xml.c:683: error: 'GladeXMLPrivate' has no member named 'tooltips'
    glade-xml.c:685: error: 'GladeXMLPrivate' has no member named 'tooltips'
    glade-xml.c: In function 'glade_xml_handle_widget_prop':
    glade-xml.c:715: error: 'GladeXMLPrivate' has no member named 'name_hash'
    glade-xml.c:726: error: 'GladeXMLPrivate' has no member named 'deferred_props'
    glade-xml.c:726: error: 'GladeXMLPrivate' has no member named 'deferred_props'
    glade-xml.c: In function 'glade_xml_ensure_accel':
    glade-xml.c:743: error: 'GladeXMLPrivate' has no member named 'accel_group'
    glade-xml.c:744: error: 'GladeXMLPrivate' has no member named 'accel_group'
    glade-xml.c:745: error: 'GladeXMLPrivate' has no member named 'toplevel'
    glade-xml.c:746: error: 'GladeXMLPrivate' has no member named 'toplevel'
    glade-xml.c:747: error: 'GladeXMLPrivate' has no member named 'accel_group'
    glade-xml.c:749: error: 'GladeXMLPrivate' has no member named 'accel_group'
    glade-xml.c: In function 'glade_xml_add_signals':
    glade-xml.c:768: error: 'GladeXMLPrivate' has no member named 'signals'
    glade-xml.c:770: error: 'GladeXMLPrivate' has no member named 'signals'
    glade-xml.c: In function 'glade_xml_add_atk_relations':
    glade-xml.c:850: error: 'GladeXMLPrivate' has no member named 'deferred_props'
    glade-xml.c:851: error: 'GladeXMLPrivate' has no member named 'deferred_props'
    glade-xml.c: In function 'glade_xml_finalize':
    glade-xml.c:947: error: 'GladeXMLPrivate' has no member named 'name_hash'
    glade-xml.c:949: error: 'GladeXMLPrivate' has no member named 'name_hash'
    glade-xml.c:951: error: 'GladeXMLPrivate' has no member named 'signals'
    glade-xml.c:953: error: 'GladeXMLPrivate' has no member named 'signals'
    glade-xml.c:955: error: 'GladeXMLPrivate' has no member named 'tooltips'
    glade-xml.c:956: error: 'GladeXMLPrivate' has no member named 'tooltips'
    glade-xml.c:958: error: 'GladeXMLPrivate' has no member named 'accel_group'
    glade-xml.c:959: error: 'GladeXMLPrivate' has no member named 'accel_group'
    glade-xml.c: In function 'glade_xml_set_value_from_string':
    glade-xml.c:1576: error: 'GladeXMLPrivate' has no member named 'name_hash'
    glade-xml.c: In function 'glade_xml_widget_destroy':
    glade-xml.c:2025: error: 'GladeXMLPrivate' has no member named 'name_hash'
    glade-xml.c: In function 'glade_xml_set_common_params':
    glade-xml.c:2062: error: 'GladeXMLPrivate' has no member named 'name_hash'
    glade-xml.c:2073: error: 'GladeXMLPrivate' has no member named 'deferred_props'
    glade-xml.c:2079: error: 'GladeXMLPrivate' has no member named 'deferred_props'
    glade-xml.c:2080: error: 'GladeXMLPrivate' has no member named 'deferred_props'
    make[2]: *** [glade-xml.lo] Error 1
    make[2]: *** Waiting for unfinished jobs....
    In file included from glade-init.c:35:
    glade-private.h:33: error: expected specifier-qualifier-list before 'GtkTooltips'
    make[2]: *** [glade-init.lo] Error 1
    make[2]: Leaving directory `/var/tmp/portage/gnome-base/libglade-2.6.1/work/libglade-2.6.1/glade'
    make[1]: *** [all-recursive] Error 1
    make[1]: Leaving directory `/var/tmp/portage/gnome-base/libglade-2.6.1/work/libglade-2.6.1'
    make: *** [all] Error 2
     *
     * ERROR: gnome-base/libglade-2.6.1 failed.
     * Call stack:
     *   ebuild.sh, line 1654:   Called dyn_compile
     *   ebuild.sh, line 990:   Called qa_call 'src_compile'
     *   ebuild.sh, line 44:   Called src_compile
     *   libglade-2.6.1.ebuild, line 32:   Called gnome2_src_compile
     *   gnome2.eclass, line 71:   Called die
     *
     * compile failure
     * If you need support, post the topmost build error, and the call stack if relevant.
     * A complete build log is located at '/var/tmp/portage/gnome-base/libglade-2.6.1/temp/build.log'.
     *
    
     * Messages for package gnome-base/libglade-2.6.1:
    
     *
     * ERROR: gnome-base/libglade-2.6.1 failed.
     * Call stack:
     *   ebuild.sh, line 1654:   Called dyn_compile
     *   ebuild.sh, line 990:   Called qa_call 'src_compile'
     *   ebuild.sh, line 44:   Called src_compile
     *   libglade-2.6.1.ebuild, line 32:   Called gnome2_src_compile
     *   gnome2.eclass, line 71:   Called die
     *
     * compile failure
     * If you need support, post the topmost build error, and the call stack if relevant.
     * A complete build log is located at '/var/tmp/portage/gnome-base/libglade-2.6.1/temp/build.log'.
    Nemůžete mně prosím někdo poradit??? Díky, za každou radu jsem vám vděčný.

    Na otázku zatím nikdo bohužel neodpověděl.

    Založit nové vláknoNahoru

    Tiskni Sdílej: Linkuj Jaggni to Vybrali.sme.sk Google Del.icio.us Facebook

    ISSN 1214-1267   www.czech-server.cz
    © 1999-2015 Nitemedia s. r. o. Všechna práva vyhrazena.