abclinuxu.cz AbcLinuxu.cz itbiz.cz ITBiz.cz HDmag.cz HDmag.cz abcprace.cz AbcPráce.cz
AbcLinuxu hledá autory!
Inzerujte na AbcPráce.cz od 950 Kč
Rozšířené hledání
×
    dnes 16:11 | Komunita

    GNOME slaví 25 let. Přesně před pětadvaceti lety odeslal Miguel de Icaza do diskusního listu GTK+ email, který je považován za zahájení projektu GNOME, jehož cílem bylo vyvinout prostředí podobné CDE a KDE, ale založené výhradně na svobodném softwaru.

    Ladislav Hagara | Komentářů: 0
    dnes 14:22 | Komunita

    Kamera Intel MIPI IPU6 v noteboocích Lenovo ThinkPad X1 Carbon nebo Dell XPS 13 9315/9320 potřebuje na Linuxu proprietární firmware. Navíc aktuálně běží pouze na opatchovaném Linuxu 5.15. Nejenom Greg Kroah-Hartman z těchto důvodů koupi těchto notebooků nedoporučuje. Zajímavé je, že Dell XPS 9315 získal certifikaci pro Ubuntu.

    Ladislav Hagara | Komentářů: 2
    dnes 11:33 | Komunita

    Nejnovější glibc rozbíjí Easy Anti-Cheat. Řada her tak přestala fungovat. V glibc 2.36 byla odstraněna podpora DT_HASH, jež je právě v Easy Anti-Cheat od Epic Games používána. Nejnovější glibc se již dostala například do Arch Linuxu. Tam je problém řešen balíčkem glibc 2.36-2 s vrácenou podporou DT_HASH.

    Ladislav Hagara | Komentářů: 8
    dnes 10:33 | Bezpečnostní upozornění

    V knihovně pro kompresi dat zlib (Wikipedie) byla objevena bezpečnostní chyba CVE-2022-37434 s vážností CVSS 9.8. Opravená upstream verze zatím nevyšla. Chyba se samozřejmě týká i softwarů s bundlovanou zlib, viz například vydání rsync 3.2.5.

    Ladislav Hagara | Komentářů: 0
    dnes 06:00 | Nová verze

    Linus Torvalds vydal Linux 6.0-rc1. Podpora programovacího jazyka Rust se tam nedostala. Kódové jméno bylo změněno ze "Superb Owl" na "Hurr durr I'ma ninja sloth".

    Ladislav Hagara | Komentářů: 4
    včera 09:00 | Zajímavý software

    JuiceFS dospěl do verze 1.0. Jedná se o distribuovaný souborový systém kompatibilní s POSIX, HDFS a S3. Architektura JuiceFS sestává ze 3 částí: JuiceFS Client, Data Storage (S3, Azure Blob, OpenStack Swift, Ceph, MinIO, …) a Metadata Engine (Redis, TiKV, MySQL/MariaDB, PostgreSQL, SQLite, …). Zdrojové kódy JuiceFS jsou k dispozici na GitHubu pod licencí Apache 2.0.

    Ladislav Hagara | Komentářů: 15
    13.8. 14:11 | Komunita

    O víkendu probíhá online The Raku Conference 2022, tj. konference věnovaná programovacímu jazyku Raku.

    Ladislav Hagara | Komentářů: 7
    12.8. 17:22 | IT novinky

    Včera skončila bezpečnostní konference Black Hat USA 2022 (Twitter) a začala bezpečnostní konference DEF CON 30 (Twitter). V rámci Black Hat byly vyhlášeny výsledky letošní Pwnie Awards (Twitter). Pwnie Awards oceňují to nejlepší, ale i to nejhorší z IT bezpečnosti (bezpečnostní Oscar a Malina v jednom).

    Ladislav Hagara | Komentářů: 0
    12.8. 15:00 | Nová verze

    Vývojáři PostgreSQL oznámili vydání verzí 14.5, 13.8, 12.12, 11.17, 10.22 a 15 Beta 3. Opraveno je více než 40 chyb a také zranitelnost CVE-2022-2625. Upstream podpora verze 10 končí 10. listopadu letošního roku.

    Ladislav Hagara | Komentářů: 0
    11.8. 18:11 | Nová verze

    Byla vydána verze 1.63.0 programovacího jazyka Rust (Wikipedie). Podrobnosti v poznámkách k vydání. Vyzkoušet Rust lze například na stránce Rust by Example.

    Ladislav Hagara | Komentářů: 14
    Audioknihy ve srovnání s knihami tištěnými (papírovými nebo elektronickými) poslouchám
     (39%)
     (3%)
     (6%)
     (53%)
    Celkem 225 hlasů
     Komentářů: 2, poslední 13.8. 11:46
    Rozcestník


    Dotaz: 2.4.18-14: chyba pri instalacii modulov

    22.10.2004 21:11 Kilian!
    2.4.18-14: chyba pri instalacii modulov
    Přečteno: 95×
    Pri kompilacii jadra dojde k chybe. V adresari /usr/src/linux-2.4.18-14/ spustim (bez uprav jadra) sekvenciu prikazov:

    make dep; make clean; make bzImage; make modules; make modules_install;

    Vytvorenie zavislosti prebehne bez problemov. Takisto aj mazanie starych a nepotrebnych suborov (make clean). Vytvorenie obrazu prejde tiez hladko, no pri instalacii modulov dojde k chybe.

    Tu je chybovy vystup:

    In file included from /usr/src/linux-2.4.18-14/include/linux/spinlock.h:56, from /usr/src/linux-2.4.18-14/include/linux/module.h:11, from dummy.c:34: /usr/src/linux-2.4.18-14/include/asm/spinlock.h:9: invalid suffix on integer constant
    /usr/src/linux-2.4.18-14/include/asm/spinlock.h:9: parse error before numeric constant
    /usr/src/linux-2.4.18-14/include/asm/spinlock.h:10: `printk_R_ver_str' declared as function returning a function /usr/src/linux-2.4.18-14/include/asm/spinlock.h:10: warning: function declaration isn't a prototype
    In file included from /usr/src/linux-2.4.18-14/include/linux/prefetch.h:13, from /usr/src/linux-2.4.18-14/include/linux/list.h:6, from /usr/src/linux-2.4.18-14/include/linux/module.h:12, from dummy.c:34: /usr/src/linux-2.4.18-14/include/asm/processor.h:51: warning: parameter names (without types) in function declaration
    /usr/src/linux-2.4.18-14/include/asm/processor.h:51: field `loops_per_jiffy_R_ver_str' declared as a function
    /usr/src/linux-2.4.18-14/include/asm/processor.h:73: invalid suffix on integer constant
    /usr/src/linux-2.4.18-14/include/asm/processor.h:73: parse error before numeric constant
    /usr/src/linux-2.4.18-14/include/asm/processor.h:73: warning: function declaration isn't a prototype In file included from /usr/src/linux-2.4.18-14/include/linux/prefetch.h:13, from /usr/src/linux-2.4.18-14/include/linux/list.h:6, from /usr/src/linux-2.4.18-14/include/linux/module.h:12, from dummy.c:34: /usr/src/linux-2.4.18-14/include/asm/processor.h:258:1: warning: "EISA_bus" redefined /usr/src/linux-2.4.18-14/include/asm/processor.h:260: warning: parameter names (without types) in function declaration
    /usr/src/linux-2.4.18-14/include/asm/processor.h:436: invalid suffix on floating constant
    /usr/src/linux-2.4.18-14/include/asm/processor.h:436: parse error before numeric constant
    /usr/src/linux-2.4.18-14/include/asm/processor.h:436: `kernel_thread_R_ver_str' declared as function returning a function
    /usr/src/linux-2.4.18-14/include/asm/processor.h:436: warning: function declaration isn't a prototype
    In file included from dummy.c:34: /usr/src/linux-2.4.18-14/include/linux/module.h:183: invalid suffix on integer constant
    /usr/src/linux-2.4.18-14/include/linux/module.h:183: parse error before numeric constant
    /usr/src/linux-2.4.18-14/include/linux/module.h:183: `inter_module_register_R_ver_str' declared as function returning a function
    /usr/src/linux-2.4.18-14/include/linux/module.h:183: warning: function declaration isn't a prototype
    /usr/src/linux-2.4.18-14/include/linux/module.h:184: invalid suffix on integer constant
    /usr/src/linux-2.4.18-14/include/linux/module.h:184: parse error before numeric constant
    /usr/src/linux-2.4.18-14/include/linux/module.h:184: `inter_module_unregister_R_ver_str' declared as function returning a function
    /usr/src/linux-2.4.18-14/include/linux/module.h:184: warning: function declaration isn't a prototype
    /usr/src/linux-2.4.18-14/include/linux/module.h:185: `inter_module_get_R_ver_str' declared as function returning a function
    /usr/src/linux-2.4.18-14/include/linux/module.h:185: warning: parameter names (without types) in function declaration
    /usr/src/linux-2.4.18-14/include/linux/module.h:186: `inter_module_get_request_R_ver_str' declared as function returning a function
    /usr/src/linux-2.4.18-14/include/linux/module.h:186: warning: parameter names (without types) in function declaration
    /usr/src/linux-2.4.18-14/include/linux/module.h:187: invalid suffix on integer constant
    /usr/src/linux-2.4.18-14/include/linux/module.h:187: parse error before numeric constant
    /usr/src/linux-2.4.18-14/include/linux/module.h:187: `inter_module_put_R_ver_str' declared as function returning a function
    /usr/src/linux-2.4.18-14/include/linux/module.h:187: warning: function declaration isn't a prototype
    /usr/src/linux-2.4.18-14/include/linux/module.h:196: `try_inc_mod_count_R_ver_str' declared as function returning a function
    /usr/src/linux-2.4.18-14/include/linux/module.h:196: warning: parameter names (without types) in function declaration
    make[2]: *** [dummy.o] Error 1
    make[1]: *** [_modsubdir_net] Error 2
    make: *** [_mod_drivers] Error 2

    V com je problem? Ako sa tomuto vyhnut? Potrebujem pridat modul "video4linux", no bezohladu na to ci mam v "config" video4linux zapnute ako modul alebo vypnute, chyba je rovnaka :(. - K! -

    Odpovědi

    23.10.2004 02:23 unchallenger | skóre: 69 | blog: unchallenger
    Rozbalit Rozbalit vše Re: 2.4.18-14: chyba pri instalacii modulov
    Kdes přišel dnes k takovému historickému a děravému jádru jako 2.4.18? Nechceš alespoň upgradnout na aktuální jádro řady 2.4, než začneš něco řešit?

    A co je na tom řádku 9, kde to hlásí tu chybu (stahovat 2.4.18, navíc podle toho -14 opatchované z náhodné neznámé distribuce, aby se tam podíval, se asi nikomu nechce)? Jakým gcc to kompiluješ?

    S v4l to nesouvisí, vždyť je to úplně jinde...

    Založit nové vláknoNahoru

    Tiskni Sdílej: Linkuj Jaggni to Vybrali.sme.sk Google Del.icio.us Facebook

    ISSN 1214-1267   www.czech-server.cz
    © 1999-2015 Nitemedia s. r. o. Všechna práva vyhrazena.