Memtest86+ (Wikipedie), svobodný nástroj pro kontrolu operační paměti, byl vydán ve verzi 9.00. S podporou architektury AArch64 (ARM64).
Společnost Fairphone stojící za stejnojmennými mobilními telefony představila (pdf) bezdrátová špuntová sluchátka Fairbuds 2. Opravitelná, s vyměnitelnými bateriemi a tříletou zárukou. Cena 119 eur.
O víkendu 17. a 18. října lze na brněnském výstavišti navštívit s jednou vstupenkou dvě akce: Maker Faire Brno, festival inovací, kreativity a kutilství, a GameDev Connect, akci určenou pro všechny současné a hlavně budoucí herní vývojáře.
Canonical vydal (email) Ubuntu 26.10 Stonking Stingray. Přehled novinek v poznámkách k vydání. Jedná se o průběžné vydání s podporou 9 měsíců, tj. do července 2027.
České Radiokomunikace (CRA) ve čtvrtek odstřelily rozhlasový vysílač Liblice B, dosud nejvyšší stavbu v Česku. O demolici dvou 355 metrů vysokých stožárů rozhodly z důvodu jejich nevyužívání, už v úterý přitom zhasly a demontovaly jejich osvětlení.
Microsoft Defender nově podporuje linuxové desktopy.
Oficiální Epic Games Launcher je v nové preview verzi poprvé dostupný i pro Linux (FAQ). Pracuje se na novém Easy Anti-Cheatu pro Linux (EAC Linux v2) a podpoře hry Fortnite na Linuxu.
Desktopové prostředí KDE Plasma bylo vydáno ve verzi 6.8. Novinky zahrnují lepší podporu vzdálené plochy, sdílení a nahrávání obrazovky a řadu drobností napříč uživatelským rozhraním (úplný seznam změn, shrnutí ve wiki).
Apple představil 7palcový displej Apple HomeView s podporou Apple Intelligence a Siri AI pro ovládání chytré domácnosti, novou řadu vybavení chytré domácnosti Apple Home Collection, další generaci HomePodu mini a novou Apple TV 4K. Apple HomeView není v Evropské unii v prodeji, jelikož umělá inteligence Siri v rámci systému iOS v EU momentálně není k dispozici. Apple spolupracuje s EU a snaží se najít cestu, jak situaci vyřešit.
KDE slaví 30 let. Přesně před 30 lety, 14. října 1996, poslal Matthias Ettrich do diskusní skupiny comp.os.linux.misc zprávu, která započala historii projektu KDE. Důležité milníky jsou zobrazeny na časové ose.
dpkg -i /home/.../linux-sourcejsem ho chtel nainstalovat(rozbalit do /usr/src/l) ale naskoci chyba...
skeletonix@ubuntu:~$ sudo dpkg -i /home/skeletonix/linux-source-2.6.12_2.6.12-9.23_all.deb Password: (Čtu databázi ... nyní je nainstalováno 60080 souborů a adresářů.) Rozbaluji linux-source-2.6.12 (z .../linux-source-2.6.12_2.6.12-9.23_all.deb) ... dpkg-deb (podproces): zkrácené čtení v buffer_copy (nelze zapisovat do roury během kopírování) dpkg-deb: podproces paste vrátil chybový status 2 dpkg: chyba při zpracovávání /home/skeletonix/linux-source-2.6.12_2.6.12-9.23_all.deb (--install): zkrácené čtení v buffer_copy (dpkg-deb během `./usr/src/linux-source-2.6.12.tar.bz2') Při zpracování nastaly chyby: /home/skeletonix/linux-source-2.6.12_2.6.12-9.23_all.deba tak jsem si stahl primo kernel zabalenej a kdyz dam make menuconfig tak se prozmenu ojevi tyto chyby:...
skeletonix@ubuntu:/usr/src/linux-source-2.6.12-2.6.12$ sudo make menuconfig
HOSTCC scripts/basic/fixdep
scripts/basic/fixdep.c:105:23: error: sys/types.h: není souborem ani adresářem
scripts/basic/fixdep.c:106:22: error: sys/stat.h: není souborem ani adresářem
scripts/basic/fixdep.c:107:22: error: sys/mman.h: není souborem ani adresářem
scripts/basic/fixdep.c:108:20: error: unistd.h: není souborem ani adresářem
scripts/basic/fixdep.c:109:19: error: fcntl.h: není souborem ani adresářem
scripts/basic/fixdep.c:110:20: error: string.h: není souborem ani adresářem
scripts/basic/fixdep.c:111:20: error: stdlib.h: není souborem ani adresářem
scripts/basic/fixdep.c:112:19: error: stdio.h: není souborem ani adresářem
In file included from /usr/lib/gcc/i486-linux-gnu/4.0.2/include/syslimits.h:7,
from /usr/lib/gcc/i486-linux-gnu/4.0.2/include/limits.h:11,
from scripts/basic/fixdep.c:113:
/usr/lib/gcc/i486-linux-gnu/4.0.2/include/limits.h:122:61: error: limits.h: není souborem ani adresářem
scripts/basic/fixdep.c:114:19: error: ctype.h: není souborem ani adresářem
scripts/basic/fixdep.c:115:23: error: arpa/inet.h: není souborem ani adresářem
scripts/basic/fixdep.c: In function ‘usage’:
scripts/basic/fixdep.c:129: warning: implicit declaration of function ‘fprintf’
scripts/basic/fixdep.c:129: warning: incompatible implicit declaration of built-in function ‘fprintf’
scripts/basic/fixdep.c:129: error: ‘stderr’ undeclared (first use in this function)
scripts/basic/fixdep.c:129: error: (Each undeclared identifier is reported only once
scripts/basic/fixdep.c:129: error: for each function it appears in.)
scripts/basic/fixdep.c:130: warning: implicit declaration of function ‘exit’
scripts/basic/fixdep.c:130: warning: incompatible implicit declaration of built-in function ‘exit’
scripts/basic/fixdep.c: In function ‘print_cmdline’:
scripts/basic/fixdep.c:135: warning: implicit declaration of function ‘printf’
scripts/basic/fixdep.c:135: warning: incompatible implicit declaration of built-in function ‘printf’
scripts/basic/fixdep.c: At top level:
scripts/basic/fixdep.c:138: error: ‘NULL’ undeclared here (not in a function)
scripts/basic/fixdep.c: In function ‘grow_config’:
scripts/basic/fixdep.c:151: warning: implicit declaration of function ‘realloc’
scripts/basic/fixdep.c:151: warning: assignment makes pointer from integer without a cast
scripts/basic/fixdep.c:153: warning: implicit declaration of function ‘perror’
scripts/basic/fixdep.c:153: warning: incompatible implicit declaration of built-in function ‘exit’
scripts/basic/fixdep.c: In function ‘is_defined_config’:
scripts/basic/fixdep.c:169: warning: implicit declaration of function ‘memcmp’
scripts/basic/fixdep.c: In function ‘define_config’:
scripts/basic/fixdep.c:182: warning: implicit declaration of function ‘memcpy’
scripts/basic/fixdep.c:182: warning: incompatible implicit declaration of built-in function ‘memcpy’
scripts/basic/fixdep.c: In function ‘use_config’:
scripts/basic/fixdep.c:201: error: ‘PATH_MAX’ undeclared (first use in this function)
scripts/basic/fixdep.c:209: warning: incompatible implicit declaration of built-in function ‘memcpy’
scripts/basic/fixdep.c:215: warning: implicit declaration of function ‘tolower’
scripts/basic/fixdep.c:217: warning: incompatible implicit declaration of built-in function ‘printf’
scripts/basic/fixdep.c:201: warning: unused variable ‘s’
scripts/basic/fixdep.c: At top level:
scripts/basic/fixdep.c:220: error: syntax error before ‘size_t’
scripts/basic/fixdep.c:221: warning: function declaration isn’t a prototype
scripts/basic/fixdep.c: In function ‘parse_config_file’:
scripts/basic/fixdep.c:222: error: ‘map’ undeclared (first use in this function)scripts/basic/fixdep.c:222: error: ‘len’ undeclared (first use in this function)scripts/basic/fixdep.c:228: warning: implicit declaration of function ‘ntohl’
scripts/basic/fixdep.c:239: warning: implicit declaration of function ‘isalnum’
scripts/basic/fixdep.c:245: warning: pointer targets in passing argument 1 of ‘use_config’ differ in signedness
scripts/basic/fixdep.c: In function ‘strrcmp’:
scripts/basic/fixdep.c:252: warning: implicit declaration of function ‘strlen’
scripts/basic/fixdep.c:252: warning: incompatible implicit declaration of built-in function ‘strlen’
scripts/basic/fixdep.c: In function ‘do_config_file’:
scripts/basic/fixdep.c:263: error: storage size of ‘st’ isn’t known
scripts/basic/fixdep.c:267: warning: implicit declaration of function ‘open’
scripts/basic/fixdep.c:267: error: ‘O_RDONLY’ undeclared (first use in this function)
scripts/basic/fixdep.c:269: warning: incompatible implicit declaration of built-in function ‘fprintf’
scripts/basic/fixdep.c:269: error: ‘stderr’ undeclared (first use in this function)
scripts/basic/fixdep.c:271: warning: incompatible implicit declaration of built-in function ‘exit’
scripts/basic/fixdep.c:273: warning: implicit declaration of function ‘fstat’
scripts/basic/fixdep.c:275: warning: implicit declaration of function ‘close’
scripts/basic/fixdep.c:278: warning: implicit declaration of function ‘mmap’
scripts/basic/fixdep.c:278: error: ‘PROT_READ’ undeclared (first use in this function)
scripts/basic/fixdep.c:278: error: ‘MAP_PRIVATE’ undeclared (first use in this function)
scripts/basic/fixdep.c:278: warning: assignment makes pointer from integer without a cast
scripts/basic/fixdep.c:287: warning: implicit declaration of function ‘munmap’
scripts/basic/fixdep.c:263: warning: unused variable ‘st’
scripts/basic/fixdep.c: At top level:
scripts/basic/fixdep.c:292: error: syntax error before ‘size_t’
scripts/basic/fixdep.c:293: warning: function declaration isn’t a prototype
scripts/basic/fixdep.c: In function ‘parse_dep_file’:
scripts/basic/fixdep.c:294: error: ‘map’ undeclared (first use in this function)scripts/basic/fixdep.c:295: error: ‘len’ undeclared (first use in this function)scripts/basic/fixdep.c:297: error: ‘PATH_MAX’ undeclared (first use in this function)
scripts/basic/fixdep.c:299: warning: implicit declaration of function ‘strchr’
scripts/basic/fixdep.c:299: warning: incompatible implicit declaration of built-in function ‘strchr’
scripts/basic/fixdep.c:299: warning: pointer targets in passing argument 1 of ‘strchr’ differ in signedness
scripts/basic/fixdep.c:299: warning: pointer targets in assignment differ in signedness
scripts/basic/fixdep.c:301: warning: incompatible implicit declaration of built-in function ‘fprintf’
scripts/basic/fixdep.c:301: error: ‘stderr’ undeclared (first use in this function)
scripts/basic/fixdep.c:302: warning: incompatible implicit declaration of built-in function ‘exit’
scripts/basic/fixdep.c:304: warning: incompatible implicit declaration of built-in function ‘memcpy’
scripts/basic/fixdep.c:305: warning: incompatible implicit declaration of built-in function ‘printf’
scripts/basic/fixdep.c:297: warning: unused variable ‘s’
scripts/basic/fixdep.c: In function ‘print_deps’:
scripts/basic/fixdep.c:334: error: storage size of ‘st’ isn’t known
scripts/basic/fixdep.c:338: error: ‘O_RDONLY’ undeclared (first use in this function)
scripts/basic/fixdep.c:340: warning: incompatible implicit declaration of built-in function ‘fprintf’
scripts/basic/fixdep.c:340: error: ‘stderr’ undeclared (first use in this function)
scripts/basic/fixdep.c:342: warning: incompatible implicit declaration of built-in function ‘exit’
scripts/basic/fixdep.c:346: warning: incompatible implicit declaration of built-in function ‘fprintf’
scripts/basic/fixdep.c:350: error: ‘PROT_READ’ undeclared (first use in this function)
scripts/basic/fixdep.c:350: error: ‘MAP_PRIVATE’ undeclared (first use in this function)
scripts/basic/fixdep.c:350: warning: assignment makes pointer from integer without a cast
scripts/basic/fixdep.c:334: warning: unused variable ‘st’
scripts/basic/fixdep.c: In function ‘traps’:
scripts/basic/fixdep.c:369: warning: incompatible implicit declaration of built-in function ‘fprintf’
scripts/basic/fixdep.c:369: error: ‘stderr’ undeclared (first use in this function)
scripts/basic/fixdep.c:371: warning: incompatible implicit declaration of built-in function ‘exit’
make[1]: *** [scripts/basic/fixdep] Error 1
make: *** [scripts_basic] Error 2
Nevite prosim nekdo jak to sprovoznit abych mohl skopilovat nove jadro.Byl bych moc vdecen!! Ubuntu 5.10
Dik vsem mno, kernel headers nejsou, ty musim mit nainstalovany abych mohl sprovoznit ten balicek kernel-sources..myslel jsem ze je to vse v tom... Kdyz jsem pod Mandrake stahl vanilla kernel tak jsme ho jen rozbalil a vse je jelo jak ma(make menuconfik,make modules..)!! a pod ubuntu mi to hazi chybu viz vise 1.chyba..
Jak jsme psal potrebuji prekompilovat kernel,potrebuju donej dodat ovladac(modul)pro USB modem(cxacru), nejradej bychto udelal pres balicky kernelu,ale ani primo vanillo jadro mi nejde skompilovat viz 2.chybacd /usr/src wget http://www.kernel.org/pub/linux/kernel/v2.6/linux-2.6.14.tar.bz2 tar xjf linux-2.6.14.tar.bz2 ln -sf linux-2.6.14 linux cd linux make menuconfig make bzImage && make modules && make modules_install cp System.map /boot/System.map-2.6.14 cp arch/i386/boot/bzImage /boot/vmlinuz-2.6.14A pak podle libosti budto rovnou zmena konfigurace lila, nebo nejdriv uprava symlinku /boot/vmlinuz a /boot/vmlinuz.old, abych neprisel o moznost nabootovat puvodni jadro pokud nove jadro z nejakho duvodu nenabootuje, a hotovo...
md5sum balicek_se_zdrojaky_jadra.deb... scripts/basic/fixdep.c:110:20: error: string.h: není souborem ani adresářem scripts/basic/fixdep.c:111:20: error: stdlib.h: není souborem ani adresářem scripts/basic/fixdep.c:112:19: error: stdio.h: není souborem ani adresářem ...Chtělo by si ty hlášky taky přečíst! Tobě nechybí kernel-headers, ale základní systémové hlavičkové soubory! Ovšem Ubuntu neznám, tak nevím, který balík musíš doinstalovat.
skeletonix@ubuntu:/usr/src/linux-source-2.6.12$ sudo make menuconfig /usr/src/linux-source-2.6.12/scripts/gcc-version.sh: line 11: gcc-3.4: command not found /usr/src/linux-source-2.6.12/scripts/gcc-version.sh: line 12: gcc-3.4: command not found HOSTCC scripts/basic/fixdep /bin/sh: gcc-3.4: command not found make[1]: *** [scripts/basic/fixdep] Error 127 make: *** [scripts_basic] Error 2a to gcc mam urcite version 4.00.Nevis co je zapotis tohle?
skeletonix@ubuntu:~$ gcc --version gcc (GCC) 4.0.2 20050808 (prerelease) (Ubuntu 4.0.1-4ubuntu9) Copyright (C) 2005 Free Software Foundation, Inc. This is free software; see the source for copying conditions. There is NO warranty; not even for MERCHANTABILITY or FITNESS FOR A PARTICULAR PURPOSE.jak jsme psal..ale nebezi to porad to pise to same
/bin/sh: gcc-3.4: command not found gcc (GCC) 4.0.2 20050808
LC_MESSAGES="C" sudo dpkg -i /home/skeletonix/linux-source-2.6.12_2.6.12-9.23_all.deb
Sice to zase vyhodí chybu, ale ta bude anglicky a tudíž ji bude možné strčit do Google a prohledat mailing-list Debianu.
(Pokud nebude fungovat "C", dej tam "en_GB" nebo "en_US")
Tiskni
Sdílej: