abclinuxu.cz AbcLinuxu.cz itbiz.cz ITBiz.cz HDmag.cz HDmag.cz abcprace.cz AbcPráce.cz
AbcLinuxu hledá autory!
Inzerujte na AbcPráce.cz od 950 Kč
Rozšířené hledání
×
    včera 12:00 | Pozvánky

    Konference LinuxDays 2026 proběhne již tento víkend 3. a 4. října v Praze v areálu ČVUT v Dejvicích na FIT. Konference LinuxDays 2026 znamená desítky přednášek a workshopů, zástup zajímavých osobností, místo pro setkání, spoustu nových nápadů a informací a stánky řady různých projektů: Fedora, openSUSE, vpsFree.cz, Mozilla, MacGyver - bastlíři SH, OpenAlt a mnoho dalších. Vstup je volný.

    Ladislav Hagara | Komentářů: 4
    včera 04:33 | IT novinky

    Microsoft oznámil, že WSL kontejnery (WSLC) aneb linuxové kontejnery ve Windows Subsystem for Linux (WSL) jsou již obecně dostupné. Současně popsal jejich architekturu.

    Ladislav Hagara | Komentářů: 0
    29.9. 23:22 | Komunita

    openSUSE Leap 16.1 vstoupil do RC fáze. Nově lze instalovat jako standardní systém (Standard) nebo jako neměnný systém s atomickými aktualizacemi (Immutable). Samostatná neměnná distribuce openSUSE Leap Micro končí.

    Ladislav Hagara | Komentářů: 0
    29.9. 22:22 | Nová verze

    Byl vydán Mozilla Firefox 157.0. S nejvýraznější vizuální proměnou za poslední roky. Přehled novinek v poznámkách k vydání a poznámkách k vydání pro vývojáře. Řešeny jsou rovněž bezpečnostní chyby. Nový Firefox 157 bude brzy k dispozici také na Flathubu a Snapcraftu.

    Ladislav Hagara | Komentářů: 6
    29.9. 10:33 | IT novinky

    Rodina produktů Raspberry Pi se rozšířila o Raspberry Pi Smart Display Module. Deska pro Raspberry Pi Compute Module 5 se zasouvá přímo do displejů dle specifikace Intel SDM. Cena desky je 30 dolarů.

    Ladislav Hagara | Komentářů: 0
    28.9. 23:44 | Nová verze

    Byla vydána nová verze 2.56.0 distribuovaného systému správy verzí Git. Přispělo 104 vývojářů, z toho 39 nových. Přehled novinek v příspěvku na blogu GitHubu a v poznámkách k vydání.

    Ladislav Hagara | Komentářů: 0
    28.9. 21:22 | Bezpečnostní upozornění

    Hackerská skupina ShinyHunters oznámila průnik do informačních systémů FBI, prostřednictvím zero-day zranitelnosti v platformě Oracle PeopleSoft, kterou úřad využívá mimo jiné pro náborový portál FBIJobs.gov. Útočníci tvrdí, že získali až 3 TB dat o současných i bývalých zaměstnancích a uchazečích o práci. Jako důkaz zveřejnili vzorek přibližně 5 000 záznamů obsahující jména, adresy, telefonní čísla, data narození, čísla

    … více »
    AfD 💙 | Komentářů: 3
    28.9. 21:11 | Zajímavý článek

    Doba kompilace linuxového jádra se díky rychlejšímu hardwaru a optimalizacím kbuildu snižuje k deseti sekundám. Nejnovější patche Lorenza Stoakse (vznikají i s pomocí SI) zkrátily na testovacím stroji dobu sestavení z dlouhých 22 vteřin na pouhých 15, a to bez použití RAMdisku. Testovací systém tvořily dva procesory AMD EPYC 9575F (oba dohromady poskytují celkem 128 jader a 256 vláken), čtyřiadvacet 64GB DDR5-6400 paměťových modulů a

    … více »
    AfD 💙 | Komentářů: 23
    28.9. 01:33 | Komunita

    Před rokem a půl vývojáři postmarketOS informovali, že pro projekt hledají nové jméno. Včera bylo oznámeno: postmarketOS se nově jmenuje Nura.

    Ladislav Hagara | Komentářů: 9
    27.9. 13:44 | Zajímavý projekt

    Hra Factorio dorazila na Printables. Hned teď si můžete stáhnout 65 různých modelů a nechat celou mimozemskou planetu oživnout na svém stole.

    Ladislav Hagara | Komentářů: 13
    Které desktopové prostředí na Linuxu používáte?
     (9%)
     (7%)
     (4%)
     (21%)
     (29%)
     (8%)
     (5%)
     (2%)
     (14%)
     (20%)
    Celkem 2762 hlasů
     Komentářů: 31, poslední 13.8. 00:27
    Rozcestník

    Dotaz: kompilace Groff - C++ compiler error

    29.10.2004 17:48 JUR
    kompilace Groff - C++ compiler error
    Přečteno: 417×
    ahoj mam problem. Nemuzu v GENTOO zkompilovat Groff.

    pise to:
     * Applying groff-1.19.1-stack.patch ...                                  [ ok ]
    >>> Source unpacked.
    configure: WARNING: If you wanted to set the --build type, don't use --host.
        If a cross compiler is detected then cross compile mode will be used.
    checking for i686-pc-linux-gnu-gcc... gcc
    checking for C compiler default output file name... a.out
    checking whether the C compiler works... yes
    checking whether we are cross compiling... no
    checking for suffix of executables... 
    checking for suffix of object files... o
    checking whether we are using the GNU C compiler... yes
    checking whether gcc accepts -g... yes
    checking for gcc option to accept ANSI C... none needed
    checking for i686-pc-linux-gnu-g++... g++
    checking whether we are using the GNU C++ compiler... yes
    checking whether g++ accepts -g... yes
    checking that C++ compiler can compile simple program... no
    configure: error: a working C++ compiler is required
    
    !!! ERROR: sys-apps/groff-1.19.1-r1 failed.
    !!! Function src_compile, Line 67, Exitcode 1
    !!! (no error message)
    
    
    muzete nekdo poradit, diky moc

    Odpovědi

    29.10.2004 18:05 pasmen | skóre: 45 | blog: glob | Praha
    Rozbalit Rozbalit vše Re: kompilace Groff - C++ compiler error
    Podivej se do config.log an podrobnejsi vypis. Najdi tam radku
    checking that C++ compiler can compile simple program... no
    a koukni kde je problem. Nebo to hod sem.
    29.10.2004 18:12 pasmen | skóre: 45 | blog: glob | Praha
    Rozbalit Rozbalit vše Re: kompilace Groff - C++ compiler error
    Tak jsem jeste trochu hledal (ze ty si ale nepouzil google? ;-), a hned prvni odkaz (btw, jako dotaz zadal jsem tu problemovou radku) vybehla kosata diskuse na dane tema. Zaver znel, ze pravdepodobne chybi libstdc++.so.X. Zkus se na to kouknout.
    30.10.2004 00:10 JUR
    Rozbalit Rozbalit vše Re: kompilace Groff - C++ compiler error
    no prave, ze jsem hledal a to same jsem nasel. I kdyz jsem nainstalil libstdc++-v3-3.3.4 a gcc-3.3.4-r1, tak to pise stale stejnou chybu Kde muze byt problem?
    configure:2517: test -s conftest.o                                                                      
    configure:2520: $? = 0                                                                                  
    configure:2546: g++ -c -O2 -march=pentium3 -fomit-frame-pointer  conftest.cc >&5                        
    configure:2552: $? = 0                                                                                  
    configure:2556: test -z                                                                                 
                             || test ! -s conftest.err                                                      
    configure:2559: $? = 0                                                                                  
    configure:2562: test -s conftest.o                                                                      
    configure:2565: $? = 0                                                                                  
    configure:2597: checking that C++ compiler can compile simple program                                   
    configure:2620: g++ -o conftest -O2 -march=pentium3 -fomit-frame-pointer   conftest.cc  >&5             
    configure:2623: $? = 0                                                                                  
    configure:2625: ./conftest                                                                              
    ./conftest: error while loading shared libraries: libgcc_s.so.1: cannot open shared object file: No such
    configure:2628: $? = 127                                                                                
    configure: program exited with status 127                                                               
    configure: failed program was:                                                                          
    |                                                                                                       
    |        /* confdefs.h.  */                                                                             
    |                                                                                                       
    | #define PACKAGE_NAME ""                                                                               
    | #define PACKAGE_TARNAME ""                                                                            
    | #define PACKAGE_VERSION ""                                                                            
    | #define PACKAGE_STRING ""                                                                             
    | #define PACKAGE_BUGREPORT ""                                                                          
    | #ifdef __cplusplus                                                                                    
    | extern "C" void std::exit (int) throw (); using std::exit;                                            
    | #endif                                                                                                
    | /* end confdefs.h.  */                                                                                
    |                                                                                                       
    |                                                                                                       
    | int main() {                                                                                          
    |   return 0;                                                                                           
    | }                                                                                                     
    |                                                                                                       
    |                                                                                                       
    |                                                                                                       
    configure:2638: result: no                                                                              
    configure:2640: error: a working C++ compiler is required
    
    nove poznatky ------------------- uz to jede!! prisel jsem na to chybovou hlaskou ve vypisu ldconfig -v. Psalo to, ze nelze nalezt /usr/lib/gcc-lib/i686-blablabla/3.3.3/blablabla

    ono totiz v tom adresari i686-blablabla je pouze 3.3.4. Tak jsou zkusit ten adresar symlinknout na 3.3.3 a uz to frci.

    Jeste se chci zeptat jak k tomu muze dojit? A jak to opravit cisteji?
    30.10.2004 12:43 unchallenger | skóre: 69 | blog: unchallenger
    Rozbalit Rozbalit vše Re: kompilace Groff - C++ compiler error
    Tohle už se tu jednou řešilo (viz vyhledávání). Mají v tom prostě někde bordel, protože nesedí čísla verzí -- ale myslel jsem, že to už je opraveno.
    2.2.2005 15:03 linker | skóre: 4
    Rozbalit Rozbalit vše Re: kompilace Groff - C++ compiler error
    tu uz to poriesili: http://forums.gentoo.org/viewtopic.php?p=173159 treba pridat do /etc/env.d/05gcc toto:

    LD_LIBRARY_PATH="/usr/lib/gcc-lib/i686-pc-linux-gnu/3.2.2"

    a potom uz len: source /etc/profile && env-update

    Založit nové vlákno • Nahoru

    Tiskni Sdílej: Linkuj Jaggni to Vybrali.sme.sk Google Del.icio.us Facebook

    ISSN 1214-1267   www.czech-server.cz
    © 1999-2015 Nitemedia s. r. o. Všechna práva vyhrazena.