Indická společnost eMudhra po bezpečnostním incidentu, tj. kompromitaci soukromých klíčů osmi mezilehlých certifikátů své certifikační autority, opouští globální byznys s SSL/TLS certifikáty.
Dle Phoronixu zveřejnila společnost Trend Micro prostřednictvím programu Zero Day Initiative (ZDI) několik hlášení bezpečnostních zranitelností přímo na veřejném mailing listu LKML, přestože některé chyby dosud nemají opravu začleněnou do hlavní větve jádra. Mezi hlášenými problémy jsou dvě zranitelnosti s hodnocením CVSS 9.0, týkající se SMB Direct a KSMBD, které mohou umožnit vzdálené spuštění kódu. Další hlášení se týkají … více »
Správce hesel KeePassXC byl vydán ve verzi 2.8.0. Přechází na Qt 6, podporuje vkládání hesel s Waylandem, rychlé odemykání pomocí Polkitu nebo možnost nastavení klávesových zkratek (seznam změn).
Databáze DuckDB (Wikipedie) byla vydána ve verzi 2.0.0 LTS. S kódovým názvem Cinnamon Teal (čírka skořicová). S vyladěným protokolem Quack.
V implementaci Broadcom 802.11 byla zjištěna chyba ve zpracování WPS/EAP, týká se to SDK od roku 2010. Broadcom podle výzkumníka Quentina Kaisera odmítl CVE přidělit. Modemy Huawei a Technicolor jsou používány i v ČR, v LTE routerech, běžných domácích routerech a firemních přístupových bodech, jejich současný počet a zranitelnost konkrétních verzí však zatím neznáme. Více detailů a demo. GitHub / Broadcom 802.11 SDK Detection Toolkit.
Byla vydána nová verze 10.8 z Debianu vycházející linuxové distribuce DietPi pro (nejenom) jednodeskové počítače. Přehled novinek v poznámkách k vydání. Přibyl balíček DietPi WireGuard.
Oslavte vydání openSUSE Leap 16.1 s námi v Praze! Ve středu 4. listopadu 2026 (den po vydání Leapu 16.1) vás zveme na malou oslavu vydání openSUSE Leap 16.1 do pražské kanceláře SUSE. Připravili jsme pro vás dvě krátké přednášky: … více »
Dle plánu bylo PHP vydáno v nových verzích 8.5.12, 8.4.27, 8.3.36 a 8.2.35. Opraveny jsou kritické zranitelnosti CVE-2026-109618 a CVE-2026-109619 aneb PHP2Shell.
UBports, nadace a komunita kolem Ubuntu pro telefony a tablety Ubuntu Touch, vydala Ubuntu Touch 24.04-2.1 a 24.04-1.5. S opravou kritických zranitelností.
Společnost Škoda Auto zveřejnila na Printables bezplatné 3D modely příslušenství do svých vozů (držáky na nápoje, pomůcky pro vedení kabelů, mincovníky, háčky na USB kabely a čepice pro kapsy na zadních stranách opěradel sedadel, držáky na telefony a úchyty pro horní upevnění bezpečnostních pásů).
* Applying groff-1.19.1-stack.patch ... [ ok ]
>>> Source unpacked.
configure: WARNING: If you wanted to set the --build type, don't use --host.
If a cross compiler is detected then cross compile mode will be used.
checking for i686-pc-linux-gnu-gcc... gcc
checking for C compiler default output file name... a.out
checking whether the C compiler works... yes
checking whether we are cross compiling... no
checking for suffix of executables...
checking for suffix of object files... o
checking whether we are using the GNU C compiler... yes
checking whether gcc accepts -g... yes
checking for gcc option to accept ANSI C... none needed
checking for i686-pc-linux-gnu-g++... g++
checking whether we are using the GNU C++ compiler... yes
checking whether g++ accepts -g... yes
checking that C++ compiler can compile simple program... no
configure: error: a working C++ compiler is required
!!! ERROR: sys-apps/groff-1.19.1-r1 failed.
!!! Function src_compile, Line 67, Exitcode 1
!!! (no error message)
muzete nekdo poradit,
diky moc
config.log an podrobnejsi vypis. Najdi tam radku
checking that C++ compiler can compile simple program... noa koukni kde je problem. Nebo to hod sem.
, a hned prvni odkaz (btw, jako dotaz zadal jsem tu problemovou radku) vybehla kosata diskuse na dane tema. Zaver znel, ze pravdepodobne chybi libstdc++.so.X. Zkus se na to kouknout.
configure:2517: test -s conftest.o
configure:2520: $? = 0
configure:2546: g++ -c -O2 -march=pentium3 -fomit-frame-pointer conftest.cc >&5
configure:2552: $? = 0
configure:2556: test -z
|| test ! -s conftest.err
configure:2559: $? = 0
configure:2562: test -s conftest.o
configure:2565: $? = 0
configure:2597: checking that C++ compiler can compile simple program
configure:2620: g++ -o conftest -O2 -march=pentium3 -fomit-frame-pointer conftest.cc >&5
configure:2623: $? = 0
configure:2625: ./conftest
./conftest: error while loading shared libraries: libgcc_s.so.1: cannot open shared object file: No such
configure:2628: $? = 127
configure: program exited with status 127
configure: failed program was:
|
| /* confdefs.h. */
|
| #define PACKAGE_NAME ""
| #define PACKAGE_TARNAME ""
| #define PACKAGE_VERSION ""
| #define PACKAGE_STRING ""
| #define PACKAGE_BUGREPORT ""
| #ifdef __cplusplus
| extern "C" void std::exit (int) throw (); using std::exit;
| #endif
| /* end confdefs.h. */
|
|
| int main() {
| return 0;
| }
|
|
|
configure:2638: result: no
configure:2640: error: a working C++ compiler is required
nove poznatky
-------------------
uz to jede!!
prisel jsem na to chybovou hlaskou ve vypisu ldconfig -v.
Psalo to, ze nelze nalezt /usr/lib/gcc-lib/i686-blablabla/3.3.3/blablabla
ono totiz v tom adresari i686-blablabla je pouze 3.3.4.
Tak jsou zkusit ten adresar symlinknout na 3.3.3 a uz to frci.
Jeste se chci zeptat jak k tomu muze dojit? A jak to opravit cisteji?
Tiskni
Sdílej: