Open-source projekt OpenDLSS-NR je 'bitově přesná reimplementace' neuronové rendrovací sítě DLSS 5 od společnosti NVIDIA, jenže pro grafické API Vulkan (DLSS slouží k vylepšování klasickým způsobem vyrendrovaných snímků pomocí lokálních modelů umělé inteligence, a to v reálném čase). Projekt není nijak spojen se společností NVIDIA, je pouze pro OS Windows a natrénované váhy modelu si uživatelé musí obstarat sami. Zdrojový kód je k dispozici na GitHubu, pod licencí MIT s výjimkou pro komponenty třetích stran.
Společnost Cloudflare představila Clef a Clef-Flash, open-source rozhodovací modely určené pro rychlou a konzistentní klasifikaci vstupů. Na rozdíl od klasických LLM vracejí tyto modely deterministické striktně typované strukturované odpovědi s exaktními pravděpodobnostmi, tedy odpovědi ve stylu přelomového modelu Jev.
… více »Byla vydána beta verze Ubuntu 26.10 s kódovým názvem Stonking Stingray. Přehled novinek v poznámkách k vydání. Dle plánu by Ubuntu 26.10 mělo vyjít 15. října 2026.
Byla vydána verze 1.99.0 programovacího jazyka Rust (Wikipedie). Podrobnosti v poznámkách k vydání. Vyzkoušet Rust lze například na stránce Rust by Example.
Od 13. do 15. října proběhne v Praze OpenSSL Conference 2026. Na YouTube lze zhlédnout videozáznamy přednášek z loňského roku.
Eben Upton oznámil další zdražení jednodeskových počítačů Raspberry Pi. Tentokrát 2 GB varianty o 12,50 dolarů. Nově 2 GB Raspberry Pi 4 stojí 67,50 dolarů a 2 GB Raspberry Pi 5 stojí 77,50 dolarů.
OpenMandriva ROME, tj. průběžně aktualizovaná (rolling) edice linuxové distribuce OpenMandriva, byla vydána ve verzi 26.09. Vedle Flatpaku také s podporou Snapu.
Edison Design Group po více než 30 letech zveřejnil zdrojový kód svého EDG C/C++ front-endu. Ten proslul širokou podporou standardů C++ a kompatibilitou s dialekty kompilátorů od Microsoftu, GNU, Clangu, Sunu a dokonce i s prehistorickým cfrontem. EDG byl použit například v kompilátoru Intel C++ Classic, kompilátoru NVCC od firmy NVIDIA pro platformu CUDA nebo v našeptávači kódu IntelliSense v produktech společnosti Microsoft. Projekt nyní spravuje organizace The C++ Alliance a kód je dostupný pod licencí Apache 2.0, doplněnou o výjimky projektu LLVM.
Pocket Tank je malé kapesní virtuální akvárium postavené na vývojové desce ESP32-S3-Touch-AMOLED-1.8. Na dvoujádrovém mikrokontroléru ESP32-S3 s 8 MB PSRAM a 16 MB flash paměti běží jak simulace akvária, tak i malý jazykový model určující chování rybiček. Lokální model o velikosti 7,56 MB se 14 miliony parametrů vznikl destilací modelu Gemma 4 26B, tedy učitele s 26 miliardami parametrů. Kromě firmwaru pro skutečný modul s AMOLED
… více »Open-source nástroj Jevstiller vytváří (destiluje) malý lokální model, který se průběžně učí z odpovědí komerční služby Jev. Běžné dotazy vyřizuje přímo na vlastním hardware, čímž může řádově zkrátit čas odezvy a snížit provozní náklady díky menšímu využívání zpoplatněného API. Nejisté požadavky Jevstiller posílá do Jevu, rovněž průběžně kontroluje náhodná dvě procenta dotazů Jevem. Pokud se lokální model začne s Jevem rozcházet,
… více »http://askubuntu.com/questions/37308/how-to-compile-asus-syntec-webcam-driver-stk11xx http://doc.ubuntu-fr.org/syntek http://wiki.ubuntu.cz/Webkamery/stk11xxTen poslední zmiňovanej hlásí tuto chybu:
make -f Makefile.standalone make -C /lib/modules/2.6.38-11-generic/build SUBDIRS=/etc/camdriver modules make[1]: Entering directory `/usr/src/linux-headers-2.6.38-11-generic' CC [M] /etc/camdriver/stk11xx-usb.o /etc/camdriver/stk11xx-usb.c: In function ‘usb_stk11xx_probe’: /etc/camdriver/stk11xx-usb.c:793:2: error: implicit declaration of function ‘init_MUTEX’ make[2]: *** [/etc/camdriver/stk11xx-usb.o] Error 1 make[1]: *** [_module_/etc/camdriver] Error 2 make[1]: Leaving directory `/usr/src/linux-headers-2.6.38-11-generic' make: *** [driver] Error 2Poraďte mi prosím. Díky
make -f Makefile.standalone make -C /lib/modules/2.6.38-11-generic/build SUBDIRS=/home/jarda/svn modules make[1]: Entering directory `/usr/src/linux-headers-2.6.38-11-generic' CC [M] /home/jarda/svn/stk11xx-usb.o CC [M] /home/jarda/svn/stk11xx-v4l.o CC [M] /home/jarda/svn/stk11xx-sysfs.o CC [M] /home/jarda/svn/stk11xx-dev.o CC [M] /home/jarda/svn/stk11xx-buf.o CC [M] /home/jarda/svn/stk11xx-bayer.o CC [M] /home/jarda/svn/stk11xx-dev-0408.o CC [M] /home/jarda/svn/stk11xx-dev-0500.o CC [M] /home/jarda/svn/stk11xx-dev-a311.o CC [M] /home/jarda/svn/stk11xx-dev-a821.o CC [M] /home/jarda/svn/stk11xx-dev-6a31.o CC [M] /home/jarda/svn/stk11xx-dev-6a33.o CC [M] /home/jarda/svn/stk11xx-dev-6a51.o CC [M] /home/jarda/svn/stk11xx-dev-6a54.o CC [M] /home/jarda/svn/stk11xx-dev-6d51.o LD [M] /home/jarda/svn/stk11xx.o Building modules, stage 2. MODPOST 1 modules CC /home/jarda/svn/stk11xx.mod.o LD [M] /home/jarda/svn/stk11xx.ko make[1]: Leaving directory `/usr/src/linux-headers-2.6.38-11-generic' jarda@jarda-laptop:~/svn$ ls doxygen.cfg stk11xx-dev-a311.c stk11xx-dev-6a31.o stk11xx.mod.o Kbuild stk11xx-dev-a311.o stk11xx-dev-6a33.c stk11xx.o Kconfig stk11xx-dev-a821.c stk11xx-dev-6a33.o stk11xx-sysfs.c Makefile stk11xx-dev-a821.o stk11xx-dev-6a51.c stk11xx-sysfs.o Makefile.standalone stk11xx-dev.c stk11xx-dev-6a51.o stk11xx.txt modules.order stk11xx-dev.h stk11xx-dev-6a54.c stk11xx-usb.c Module.symvers stk11xx-dev.o stk11xx-dev-6a54.o stk11xx-usb.o README stk11xx-dev-0408.c stk11xx-dev-6d51.c stk11xx-v4l.c stk11xx-bayer.c stk11xx-dev-0408.o stk11xx-dev-6d51.o stk11xx-v4l.o stk11xx-bayer.o stk11xx-dev-0500.c stk11xx.h tags stk11xx-buf.c stk11xx-dev-0500.o stk11xx.ko stk11xx-buf.o stk11xx-dev-6a31.c stk11xx.mod.c jarda@jarda-laptop:~/svn$ sudo modprobe stk11xx.ko [sudo] password for jarda: FATAL: Module stk11xx.ko not found. jarda@jarda-laptop:~/svn$ sudo modprobe stk11xx FATAL: Module stk11xx not found. jarda@jarda-laptop:~/svn$co dělám špatně?
jarda@jarda-laptop:~/svn$ sudo make -f Makefile.standalone install make -C /lib/modules/2.6.38-11-generic/build SUBDIRS= modules make[1]: Entering directory `/usr/src/linux-headers-2.6.38-11-generic' HOSTCC scripts/basic/fixdep HOSTCC scripts/basic/docproc HOSTCC scripts/kconfig/conf.o HOSTCC scripts/kconfig/kxgettext.o HOSTCC scripts/kconfig/zconf.tab.o HOSTLD scripts/kconfig/conf scripts/kconfig/conf --silentoldconfig Kconfig make[1]: Leaving directory `/usr/src/linux-headers-2.6.38-11-generic' make[1]: Entering directory `/usr/src/linux-headers-2.6.38-11-generic' CHK include/linux/version.h CHK include/generated/utsrelease.h UPD include/generated/utsrelease.h make[2]: *** No rule to make target `kernel/bounds.c', needed by `kernel/bounds.s'. Stop. make[1]: *** [prepare0] Error 2 make[1]: Leaving directory `/usr/src/linux-headers-2.6.38-11-generic' make: *** [driver] Error 2
jarda@jarda-laptop:~/svn$ sudo insmod stk11xx.ko insmod: error inserting 'stk11xx.ko': -1 Unknown symbol in module
modprobe videodev (a až potom insmod stk11xx.ko).
Mimochodom v logu (alebo dmesg) nie je napísané, aký symbol to vlastne chýba?
Tiskni
Sdílej: