Po 9 týdnech vývoje od vydání Linuxu 7.2 oznámil Linus Torvalds vydání Linuxu 7.3. Podrobný přehled novinek a vylepšení na Linux Kernel Newbies nebo LWN.net: první a druhá polovina začleňovacího okna.
Memtest86+ (Wikipedie), svobodný nástroj pro kontrolu operační paměti, byl vydán ve verzi 9.00. S podporou architektury AArch64 (ARM64).
Společnost Fairphone stojící za stejnojmennými mobilními telefony představila (pdf) bezdrátová špuntová sluchátka Fairbuds 2. Opravitelná, s vyměnitelnými bateriemi a tříletou zárukou. Cena 119 eur.
O víkendu 17. a 18. října lze na brněnském výstavišti navštívit s jednou vstupenkou dvě akce: Maker Faire Brno, festival inovací, kreativity a kutilství, a GameDev Connect, akci určenou pro všechny současné a hlavně budoucí herní vývojáře.
Canonical vydal (email) Ubuntu 26.10 Stonking Stingray. Přehled novinek v poznámkách k vydání. Jedná se o průběžné vydání s podporou 9 měsíců, tj. do července 2027.
České Radiokomunikace (CRA) ve čtvrtek odstřelily rozhlasový vysílač Liblice B, dosud nejvyšší stavbu v Česku. O demolici dvou 355 metrů vysokých stožárů rozhodly z důvodu jejich nevyužívání, už v úterý přitom zhasly a demontovaly jejich osvětlení.
Microsoft Defender nově podporuje linuxové desktopy.
Resit pak takoveto problemy je na dlouhou dobu, to radeji prislusnou cast smazu a pokusim se ji udelat nejak jinak :-/
Pane paskma, vy si z nas normalne robite prcu. Pro ty, kdo tento vtip zcela nepochopili, male postouchnuti:
$ g++-4.0 -D _GLIBCXX_CONCEPT_CHECKS test.cc ... 57 radek erroru, posledni dva (zaverecny zalomeny a odsazeny taby) ... test.cc:8: instantiated from here /usr/lib/gcc/i486-linux-gnu/4.0.3/../../../../include/c++/4.0.3/bits/boost_concept_check.h:223: error: conversion from 'std::bidirectional_iterator_tag' to non-scalar type 'std::random_access_iterator_tag' requested
------ Build started: Project: STLerror1, Configuration: Debug Win32 ------
Compiling...
main.cpp
C:\Program Files\Microsoft Visual Studio 8\VC\include\algorithm(2754) : error C2784: 'reverse_iterator<_RanIt>::difference_type std::operator -(const std::reverse_iterator<_RanIt> &,const std::reverse_iterator<_RanIt2> &)' : could not deduce template argument for 'const std::reverse_iterator<_RanIt> &' from 'std::list<_Ty>::_Iterator<_Secure_validation>'
with
[
_Ty=int,
_Secure_validation=true
]
C:\Program Files\Microsoft Visual Studio 8\VC\include\xutility(1818) : see declaration of 'std::operator -'
.\main.cpp(8) : see reference to function template instantiation 'void std::sort<std::list<_Ty>::_Iterator<_Secure_validation>>(_RanIt,_RanIt)' being compiled
with
[
_Ty=int,
_Secure_validation=true,
_RanIt=std::list<int>::_Iterator<true>
]
C:\Program Files\Microsoft Visual Studio 8\VC\include\algorithm(2754) : error C2784: 'reverse_iterator<_RanIt>::difference_type std::operator -(const std::reverse_iterator<_RanIt> &,const std::reverse_iterator<_RanIt2> &)' : could not deduce template argument for 'const std::reverse_iterator<_RanIt> &' from 'std::list<_Ty>::_Iterator<_Secure_validation>'
with
[
_Ty=int,
_Secure_validation=true
]
C:\Program Files\Microsoft Visual Studio 8\VC\include\xutility(1818) : see declaration of 'std::operator -'
C:\Program Files\Microsoft Visual Studio 8\VC\include\algorithm(2754) : error C2784: 'reverse_iterator<_RanIt>::difference_type std::operator -(const std::reverse_iterator<_RanIt> &,const std::reverse_iterator<_RanIt2> &)' : could not deduce template argument for 'const std::reverse_iterator<_RanIt> &' from 'std::list<_Ty>::_Iterator<_Secure_validation>'
with
[
_Ty=int,
_Secure_validation=true
]
C:\Program Files\Microsoft Visual Studio 8\VC\include\xutility(1818) : see declaration of 'std::operator -'
C:\Program Files\Microsoft Visual Studio 8\VC\include\algorithm(2754) : error C2784: 'reverse_iterator<_RanIt>::difference_type std::operator -(const std::reverse_iterator<_RanIt> &,const std::reverse_iterator<_RanIt2> &)' : could not deduce template argument for 'const std::reverse_iterator<_RanIt> &' from 'std::list<_Ty>::_Iterator<_Secure_validation>'
with
[
_Ty=int,
_Secure_validation=true
]
C:\Program Files\Microsoft Visual Studio 8\VC\include\xutility(1818) : see declaration of 'std::operator -'
C:\Program Files\Microsoft Visual Studio 8\VC\include\algorithm(2754) : error C2676: binary '-' : 'std::list<_Ty>::_Iterator<_Secure_validation>' does not define this operator or a conversion to a type acceptable to the predefined operator
with
[
_Ty=int,
_Secure_validation=true
]
C:\Program Files\Microsoft Visual Studio 8\VC\include\algorithm(2754) : error C2780: 'void std::_Sort(_RanIt,_RanIt,_Diff,_Pr)' : expects 4 arguments - 3 provided
C:\Program Files\Microsoft Visual Studio 8\VC\include\algorithm(2873) : see declaration of 'std::_Sort'
Build log was saved at "file://c:\Documents and Settings\student\My Documents\Visual Studio 2005\Projects\STLerror1\STLerror1\Debug\BuildLog.htm"
STLerror1 - 6 error(s), 0 warning(s)
========== Build: 0 succeeded, 1 failed, 0 up-to-date, 0 skipped ==========
Tiskni
Sdílej: